{"text_format":"1","workbook":"xlsx","n_sheets":23,"sheets":["Cover","Documentation-->","Style Guide","ToC","Inputs-->","F_Inputs-APR & PR19","F_Inputs","Consolidated actual totex inp","Non-fountain inputs","InpActive","Calc-->","Index","Time","Cost sharing calculations","Abstraction & Rates","Bioresources","Thames Tideway Tunnel","Green Recovery","Outputs-->","Outputs","F_Outputs","Integrity checks-->","Check"],"not_rendered":{"charts":0,"images":1,"macros":1,"external_links":4,"defined_names":11,"comments":1,"pivot_tables":0},"unopened":[],"bounds":{"document_bytes":16777216,"sheet_cells":100000,"rows_first":2000,"rows_last":500,"rows_between":2000,"halvings":0,"cell_chars":16384,"cell_head_chars":4096},"cells_cut":0,"cells_raw":0,"read":"whole","date_system":"1900"}

{"sheet":"Cover","index":0,"n_rows":56,"n_cols":5,"rows_kept":56,"cut":false,"hidden":false,"merged":[[39,2,40,2],[39,1,40,1],[39,3,40,3],[37,1,38,1],[37,2,38,2],[37,3,38,3],[35,1,36,1],[35,2,36,2],[35,3,36,3],[22,2,27,2],[22,3,27,3],[22,1,27,1],[29,1,30,1],[29,2,30,2],[29,3,30,3],[31,1,32,1],[31,2,32,2],[31,3,32,3],[33,1,34,1],[33,2,34,2],[33,3,34,3]]}
["Cover"]
[]
["Workbook title:","Cost sharing & total costs reconciliation"]
["Version:","4f"]
["Filename:","Cost-sharing-&-total-costs-Reconcilation-v4f"]
["Date:","July 2024"]
["Author:","Ofwat"]
["Author contact information:","PR24@ofwat.gov.uk"]
[]
[]
["Summary of workbook:","The cost sharing reconciliation model calculates any adjustment for underperformance or outperformance against forecast totex at the PR19 final determinations. "]
[null,"Separate adjustments are made for wage growth, net totex and business rates and abstraction charges. "]
[null,"The price base of the model is 2017-18 FYA CPIH with time value of money adjustments to 2024-25 present values using "]
[null,"the FD wholesale WACC deflated for long-term CPIH."]
[]
["Known limitations:","This model is subject to consultation and consequently may be subject to further changes."]
[]
["Instructions:","na"]
[]
["Amendments:","Below are details of changes to the model from the version 4a published Mar 23. The changes fix issues that have been identified and implements a change to include a bonus adjustment in the reconciliation calculations."]
[]
[null,"Category","Sheet(s) in current model","Description of change(s) made","Model link(s)"]
[null,"Policy Implementation","InpActive, Cost sharing calculations, Bioresources, Thames Tideway Tunnel","The model has been amended to adjust the reconciliation adjustments for performance related pay recovery adjustments where they are not appropriate. A new input has been added which is removed from the final adjustments for each control. For applicable controls this adjustment is also removed from baseline allowances and actual totex spends when calculation cost sharing adjustments. ",{"$f":"InpActive!$E$44","v":"Performance related pay recovery mechanism adjustment - WR - Nominal (Neg)"}]
[null,null,null,null,{"$f":"'Cost sharing calculations'!$E$96","v":"Actual net totex for cost sharing reconciliation - WR - Real"}]
[null,null,null,null,{"$f":"'Cost sharing calculations'!$E$101","v":"Total Performance related pay recovery mechanism adjustment  - WR - real"}]
[null,null,null,null,{"$f":"'Cost sharing calculations'!$E$106","v":"Actual net totex for cost sharing reconciliation - WR - Real "}]
[null,null,null,null,{"$f":"'Cost sharing calculations'!$E$127","v":"Net totex available for cost sharing after adjustments profiled - WR - Real"}]
[null,null,null,null,{"$f":"'Cost sharing calculations'!$E$180","v":"Total adjustment for cost sharing after ex ante allowance & wage adjustment - WR - Real"}]
[null,"Refinement","Abstraction & Rates","Model previously linked to business rates row, this has been amended to link to the abstraction charges line",{"$f":"'Abstraction & Rates'!$F$48","v":11.222511023359866}]
[null,"Refinement","Abstraction & Rates","Calculation has been amended to remove fixed reference linking to the business rate lines",{"$f":"'Abstraction & Rates'!$F$70","v":0}]
[null,null,null,null,{"$f":"'Abstraction & Rates'!$F$74","v":0.34782389042364947}]
[null,"Refinement","Cost sharing calculations","Calculation has been amended to calculate customer share instead of the company share",{"$f":"'Cost sharing calculations'!$F$353","v":0}]
[null,null,null,null,{"$f":"'Cost sharing calculations'!$F$526","v":0}]
[null,"Refinement","Cost sharing calculations, Bioresources","Updated formulas to link to actuals instead of allowances",{"$f":"'Cost sharing calculations'!$E$498","v":"Actuals for CMA excluded items - WWN - nominal"}]
[null,null,null,null,{"$f":"Bioresources!$E$67","v":"Actuals for CMA excluded items - BIO - nominal"}]
[null,"Refinement","Cost sharing calculations, Bioresources","Updated formulas to link to allowances instead of actuals",{"$f":"'Cost sharing calculations'!$E$502","v":"Allowance for CMA excluded items - WWN - real"}]
[null,null,null,null,{"$f":"Bioresources!$E$71","v":"Allowance for CMA excluded items - BIO - real"}]
[null,"Refinement","Bioresources","Original formula referred to blank row, this has amended to look at rows above.",{"$f":"Bioresources!$F$91","v":-0.51383811305110361}]
[null,null,null,null,{"$f":"Bioresources!$F$95","v":-0.19004971304629861}]
[null,"Refinement","Cost sharing calculations, Bioresources","Line originally referred to total variance for the AMP, this has been updated to look up to the annual basis.",{"$f":"Bioresources!$E$75","v":"Variance to allowances for CMA excluded items - BIO"}]
[null,null,null,null,{"$f":"'Cost sharing calculations'!$E$506","v":"Variance to allowances for CMA excluded items - WWN"}]
[null,"Refinement","Bioresources","Updated formula in cell F95 to read calculate RCV adjustment on total adjustment * (1 - PAYG rate)",{"$f":"Bioresources!$F$95","v":-0.19004971304629861}]
[]
["References:","Totex allowances made in the final determinations"]
[null,"PAYG rates from the final determinations"]
[null,"OBR Forecast wage growth from the final determinations"]
[null,"WACC from the final determinations"]
[null,"Cost sharing rates and ex ante allowances from Final determinations"]
[null,"ASHE Gross Hourly Wage index"]
[null,"Actual CPIH index published by the ONS"]
[]
["Error Checks:","Total error check status"]
[null,{"$f":"Check!$F$8","v":0}]
[]
[]
["END OF SHEET"]

{"sheet":"Documentation-->","index":1,"n_rows":0,"n_cols":0,"rows_kept":0,"cut":false,"hidden":false,"merged":[]}

{"sheet":"Style Guide","index":2,"n_rows":52,"n_cols":10,"rows_kept":52,"cut":false,"hidden":false,"merged":[]}
[{"$f":" RIGHT(CELL(\"filename\", $A$1), LEN(CELL(\"filename\", $A$1)) - SEARCH(\"]\", CELL(\"filename\", $A$1)))","v":{"$error":"#VALUE!"}}]
[]
["SHEET TABS"]
[]
[null,null,null,null,null,null,null,"Light Yellow",null,"Input sheets"]
[]
[null,null,null,null,null,null,null,"No colour (default Excel tab colour)",null,"Calculation and documentation sheets"]
[]
[null,null,null,null,null,null,null,"Pale Blue",null,"Key output sheets"]
[]
[null,null,null,null,null,null,null,"Turquoise",null,"Quality control sheets"]
[]
[null,null,null,null,null,null,null,"Yellow",null,"To be completed, temporary, restructured, or deleted"]
[]
[]
["COLOUR"]
[]
[null,"Font colour only"]
[null,null,null,null,null,null,null,"Blue font",null,"Imported from another sheet"]
[]
[null,null,null,null,null,null,null,"Red font ",null,"Exported to another sheet (except from Input sheets)"]
[]
[null,null,null,null,null,null,null,"Black font",null,"Within sheet link or calculation"]
[]
[null,"Font + shade combinations"]
[null,null,null,null,null,null,null,"Black font + Light Yellow shade",null,"Inputs"]
[]
[null,null,null,null,null,null,null,"Black font + Light Yellow shade with grey stripe",null,"Inputs that are not expected to be changed"]
[]
[null,null,null,null,null,null,null,"Black font + Light Grey shade on entire row",null,"Within-worksheet counter-flow "]
[]
[null,null,null,null,null,null,null,"Blue font + Light Grey shade on entire row",null,"Between-worksheet counter-flow "]
[]
[null,null,null,null,null,null,null,"Empty Cell with Light Grey shade",null,"Empty cells being deliberately referenced"]
[]
[null,"Other"]
[null,null,null,null,null,null,null,"Black font + Pale Blue shade on entire row",null,"Section separator"]
[]
[null,null,null,null,null,null,null,"Light Turquoise shade",null,"Stored/dead/hard coded outputs"]
[]
[null,null,null,null,null,null,null,"Tan shade",null,"Pre-model time line actuals"]
[]
[null,null,null,null,null,null,null,"Yellow shade",null,"Work in progress / temporary"]
[]
[null,null,null,null,null,null,null,"Lime shade",null,"Values or logic to be reviewed"]
[]
[null,"Error checks"]
[null,null,null,null,null,null,null,"Green shade",null,"OK"]
[]
[null,null,null,null,null,null,null,"Red shade",null,"Error"]
[]
["End of sheet"]

{"sheet":"ToC","index":3,"n_rows":26,"n_cols":10,"rows_kept":26,"cut":false,"hidden":false,"merged":[]}
[{"$f":" RIGHT(CELL(\"filename\", $A$1), LEN(CELL(\"filename\", $A$1)) - SEARCH(\"]\", CELL(\"filename\", $A$1)))","v":{"$error":"#VALUE!"}}]
[]
[null,"ASSUMPTIONS",null,"INPUTS",null,"CALCULATIONS",null,"OUTPUTS",null,"Quality Control"]
[]
[null,{"$f":"Cover!A1","v":"Cover"},null,{"$f":"InpActive!A1","v":{"$error":"#VALUE!"}},null,{"$f":"Index!A1","v":{"$error":"#VALUE!"}},null,{"$f":"Outputs!A1","v":{"$error":"#VALUE!"}},null,{"$f":"Check!A1","v":{"$error":"#VALUE!"}}]
[null,"Model documentation sheet",null,"Inputs sheet",null,"All the indexation related calculations are done in this sheet.",null,"Main output sheet showing total cost sharing adjustments",null,"Contains all the model integrity checks and alerts"]
[]
[null,{"$f":"'Style Guide'!A1","v":{"$error":"#VALUE!"}},null,null,null,{"$f":"Time!A1","v":{"$error":"#VALUE!"}}]
[null,"Explanation of different formatting types",null,null,null,"The model timeline and flag calculations are done in this sheet."]
[]
[null,{"$f":"A1","v":{"$error":"#VALUE!"}},null,null,null,{"$f":"'Cost sharing calculations'!A1","v":{"$error":"#VALUE!"}}]
[null,"Table of contents",null,null,null,"Calculates the cost sharing adjustments to be made at PR24"]
[]
[null,null,null,null,null,"Abstraction & Rates"]
[null,null,null,null,null,"Calculates the sharing adjustments for business rates and abstraction charges to be made at PR24"]
[]
[null,null,null,null,null,{"$f":"Bioresources!$A$1","v":{"$error":"#VALUE!"}}]
[null,null,null,null,null,"Calculates the totex reconciliation adjustments for bioresources to be made at PR24"]
[]
[null,null,null,null,null,"Thames Tideway Tunnel"]
[null,null,null,null,null,"Calculates the sharing adjustments for Thames Tideway Tunnel to be made PR24"]
[]
[null,null,null,null,null,"Green recovery"]
[null,null,null,null,null,"Calculates the cost sharing adjustments for green recovery to be made at PR24"]
[]
["End of sheet"]

{"sheet":"Inputs-->","index":4,"n_rows":0,"n_cols":0,"rows_kept":0,"cut":false,"hidden":false,"merged":[]}

{"sheet":"F_Inputs-APR & PR19","index":5,"n_rows":652,"n_cols":17,"rows_kept":652,"cut":false,"hidden":false,"merged":[]}
[null,null,"APR/PR19 cost rec inputs",null,"Run on 19 Feb 2024 12:17"]
["Acronym","Reference","Item description","Unit","Model","Cyclical","","","","","","Price Review 2019","","","","",""]
[]
[null,null,null,null,null,"Default for Cyclical base run",null,null,null,null,null,"Default for Price Review 2019 base run"]
[null,null,null,null,null,"Latest",null,null,null,null,null,"Latest"]
[null,null,null,null,null,"2020-21","2021-22","2022-23","2023-24","2024-25","2020-25","2020-21","2021-22","2022-23","2023-24","2024-25","2020-25"]
["ANH","B0143TAWR","Totex (net of business rates, abstraction licence fees and grants and contributions) - Total actual totex  (net of business rates, abstraction licence fees and grants and contributions) - 12 months ended 31 March 2021 - Water resources","£m","Cyclical Foundation",33.33,36.6094545718612,37.129432702413098,"","","","","","","","",""]
["ANH","B0143TAWNP","Totex (net of business rates, abstraction licence fees and grants and contributions) - Total actual totex  (net of business rates, abstraction licence fees and grants and contributions) - 12 months ended 31 March 2021 - Water network plus","£m","Cyclical Foundation",344.24799999999999,398.6768108553,502.02600099974899,"","","","","","","","",""]
["ANH","B0143TAWWNP","Totex (net of business rates, abstraction licence fees and grants and contributions) - Total actual totex  (net of business rates, abstraction licence fees and grants and contributions) - 12 months ended 31 March 2021 - Wastewater network plus","£m","Cyclical Foundation",403.05799999999999,442.17748364479201,506.26912232494999,"","","","","","","","",""]
["ANH","B0143TATTTH","Totex (net of business rates, abstraction licence fees and grants and contributions) - Total actual totex  (net of business rates, abstraction licence fees and grants and contributions) - 12 months ended 31 March 2021 - Thames Tideway/ Havant Thicket","£m","Cyclical Foundation",0,0,0,"","","","","","","","",""]
["ANH","B0413TGTE_WR","Total green recovery programme expenditure  - Totex - Expenditure in report year - Water resources","£m","Cyclical Foundation","",0,0,"","","","","","","","",""]
["ANH","B0420TGTE_RW","Total green recovery programme expenditure  - Totex - Expenditure in report year - Water network+ Raw water transport","£m","Cyclical Foundation","",0,0,"","","","","","","","",""]
["ANH","B0427TGTE_SW","Total green recovery programme expenditure  - Totex - Expenditure in report year - Water network+ Raw water storage","£m","Cyclical Foundation","",0,0,"","","","","","","","",""]
["ANH","B0434TGTE_TW","Total green recovery programme expenditure  - Totex - Expenditure in report year - Water network+ Water treatment","£m","Cyclical Foundation","",0,0,"","","","","","","","",""]
["ANH","B0441TGTE_DW","Total green recovery programme expenditure  - Totex - Expenditure in report year - Water network+ Treated water distribution","£m","Cyclical Foundation","",0,0,"","","","","","","","",""]
["ANH","B0513TGTE_FOW","Total green recovery programme expenditure  - Totex - Expenditure in report year - Wastewater network+  Foul","£m","Cyclical Foundation","",0,0,"","","","","","","","",""]
["ANH","B0520TGTE_SUW","Total green recovery programme expenditure  - Totex - Expenditure in report year - Wastewater network+  Surface water drainage","£m","Cyclical Foundation","",0,0,"","","","","","","","",""]
["ANH","B0527TGTE_HDW","Total green recovery programme expenditure  - Totex - Expenditure in report year - Wastewater network+  Highway drainage","£m","Cyclical Foundation","",0,0,"","","","","","","","",""]
["ANH","B0534TGTE_STW","Total green recovery programme expenditure  - Totex - Expenditure in report year - Wastewater network+  Sewage treatment and disposal","£m","Cyclical Foundation","",0,0,"","","","","","","","",""]
["ANH","B0541TGTE_SLW","Total green recovery programme expenditure  - Totex - Expenditure in report year - Wastewater network+  Sludge liquor treatment","£m","Cyclical Foundation","",0,0,"","","","","","","","",""]
["ANH","WS01008WR","Operating expenditure - Local authority and Cumulo rates - Water resources","£m","Cyclical Foundation",2.5449999999999999,2.8869398769454802,2.3759999999999999,"","","","","","","","",""]
["ANH","BM317WN","Local authority and Cumulo rates - Water Network+","£m","Cyclical Foundation",37.585000000000001,37.852371999031597,30.827999999999999,"","","","","","","","",""]
["ANH","BM817WNK","Local authority and Cumulo rates - Wastewater Network+","£m","Cyclical Foundation",21.361999999999998,19.966563300000001,20.753978360000001,"","","","","","","","",""]
["ANH","BM817SG","Local authority and Cumulo rates - Sludge","£m","Cyclical Foundation",3.2869999999999999,3.12346506,3.21163789,"","","","","","","","",""]
["ANH","BM817TTT","Local authority rates - TTT","£m","Cyclical Foundation","",0,"","","","","","","","","",""]
["ANH","C_TBC_WR_PR19CA004_OFWAT","Total base costs exclude enhancemnt opex -  Water resources  - OFWAT view","£m","Price Review 2019","","","","","","","","","","","",194.666000127861]
["ANH","C_TBC_WN_PR19CA004_OFWAT","Total base costs exclude enhancemnt opex -  Water network plus  - OFWAT view","£m","Price Review 2019","","","","","","","","","","","",1361.7012451442499]
["ANH","C_TBC_WBR_PR19CA008_OFWAT","Total base costs - Bioresources - OFWAT view","£m","Price Review 2019","","","","","","","","","","","",383.38023754030002]
["ANH","C_TBC_WWN_PR19CA008_OFWAT","Total base costs - Wastewater network plus - OFWAT view","£m","Price Review 2019","","","","","","","","","","","",1785.8124069134101]
["ANH","C_UBC_WR_PR19CA004_OFWAT","Unmodelled base costs (Local authority and cumulo rates ) -  Water resources - OFWAT view","£m","Price Review 2019","","","","","","","","","","","",15.017879284905799]
["ANH","C_UBC_WN_PR19CA004_OFWAT","Unmodelled base costs (Local authority and cumulo rates ) -  Water network plus - OFWAT view","£m","Price Review 2019","","","","","","","","","","","",173.73642308081199]
["ANH","C_UBC_WBR_PR19CA008_OFWAT","Base costs - Unmodelled base costs (Local authority and cumulo rates ) -  Bioresources - OFWAT view","£m","Price Review 2019","","","","","","","","","","","",14.057121940915501]
["ANH","C_UBC_WWN_PR19CA008_OFWAT","Base costs - Unmodelled base costs (Local authority and cumulo rates ) -  Wastewater network plus - OFWAT view","£m","Price Review 2019","","","","","","","","","","","",100.314611395394]
["ANH","WS1003_WW4_WR","Unmodelled base costs (Abstraction charges / discharge consent) WR","£m","Price Review 2019","","","","","","","","","","","",46.109679929217897]
["ANH","WS1003_WW4_WN","Unmodelled base costs (Abstraction charges / discharge consent) WN","£m","Price Review 2019","","","","","","","","","","","",2.27478578405514]
["ANH","C_WWN_OUTPERFORM_001","Cost sharing rate for outperform","%","Price Review 2019","","","","","","","","","","","",0.34962756826139901]
["ANH","C_WWN_UNDERPERFORM_001","Cost sharing rate for underperform","%","Price Review 2019","","","","","","","","","","","",0.65037243173860104]
["ANH","B0012WR","Abstraction charges/ discharge consents - Water resources","£m","Cyclical Foundation",9.8689999999999998,10.1086312367089,10.0955657467089,"","","","","","","","",""]
["ANH","B0012WN","Abstraction charges/ discharge consents - Water Network+","£m","Cyclical Foundation",0.50700000000000001,0.48875200000000002,0.48298691999999999,"","","","","","","","",""]
["ANH","C_WR_CS_EXANTE_001","Ex-ante allowance above Ofwat forecast - Active - Water Resources","£m","Price Review 2019","","","","","","","","","","","",0]
["ANH","C_WN_CS_EXANTE_001","Ex-ante allowance above Ofwat forecast - Active - Water Network","£m","Price Review 2019","","","","","","","","","","","",0]
["ANH","C_WWN_CS_EXANTE_001","Ex-ante allowance above Ofwat forecast - Active - Wastewater Network","£m","Price Review 2019","","","","","","","","","","","",0]
["ANH","C_WR_WN_OUTPERFORM_001","Cost sharing rate for outperform","%","Price Review 2019","","","","","","","","","","","",0.31893911964359201]
["ANH","C_WR_WN_UNDERPERFORM_001","Cost sharing rate for underperform","%","Price Review 2019","","","","","","","","","","","",0.68106088035640799]
["WSH","B0143TAWR","Totex (net of business rates, abstraction licence fees and grants and contributions) - Total actual totex  (net of business rates, abstraction licence fees and grants and contributions) - 12 months ended 31 March 2021 - Water resources","£m","Cyclical Foundation",52.354999999999997,38.0685,50.47,"","","","","","","","",""]
["WSH","B0143TAWNP","Totex (net of business rates, abstraction licence fees and grants and contributions) - Total actual totex  (net of business rates, abstraction licence fees and grants and contributions) - 12 months ended 31 March 2021 - Water network plus","£m","Cyclical Foundation",234.892,237.884196,283.68700000000001,"","","","","","","","",""]
["WSH","B0143TAWWNP","Totex (net of business rates, abstraction licence fees and grants and contributions) - Total actual totex  (net of business rates, abstraction licence fees and grants and contributions) - 12 months ended 31 March 2021 - Wastewater network plus","£m","Cyclical Foundation",261.916,236.08199999999999,266.78100000000001,"","","","","","","","",""]
["WSH","B0143TATTTH","Totex (net of business rates, abstraction licence fees and grants and contributions) - Total actual totex  (net of business rates, abstraction licence fees and grants and contributions) - 12 months ended 31 March 2021 - Thames Tideway/ Havant Thicket","£m","Cyclical Foundation",0,0,0,"","","","","","","","",""]
["WSH","B0413TGTE_WR","Total green recovery programme expenditure  - Totex - Expenditure in report year - Water resources","£m","Cyclical Foundation","",0,0,"","","","","","","","",""]
["WSH","B0420TGTE_RW","Total green recovery programme expenditure  - Totex - Expenditure in report year - Water network+ Raw water transport","£m","Cyclical Foundation","",0,0,"","","","","","","","",""]
["WSH","B0427TGTE_SW","Total green recovery programme expenditure  - Totex - Expenditure in report year - Water network+ Raw water storage","£m","Cyclical Foundation","",0,0,"","","","","","","","",""]
["WSH","B0434TGTE_TW","Total green recovery programme expenditure  - Totex - Expenditure in report year - Water network+ Water treatment","£m","Cyclical Foundation","",0,0,"","","","","","","","",""]
["WSH","B0441TGTE_DW","Total green recovery programme expenditure  - Totex - Expenditure in report year - Water network+ Treated water distribution","£m","Cyclical Foundation","",0,0,"","","","","","","","",""]
["WSH","B0513TGTE_FOW","Total green recovery programme expenditure  - Totex - Expenditure in report year - Wastewater network+  Foul","£m","Cyclical Foundation","",0,0,"","","","","","","","",""]
["WSH","B0520TGTE_SUW","Total green recovery programme expenditure  - Totex - Expenditure in report year - Wastewater network+  Surface water drainage","£m","Cyclical Foundation","",0,0,"","","","","","","","",""]
["WSH","B0527TGTE_HDW","Total green recovery programme expenditure  - Totex - Expenditure in report year - Wastewater network+  Highway drainage","£m","Cyclical Foundation","",0,0,"","","","","","","","",""]
["WSH","B0534TGTE_STW","Total green recovery programme expenditure  - Totex - Expenditure in report year - Wastewater network+  Sewage treatment and disposal","£m","Cyclical Foundation","",0,0,"","","","","","","","",""]
["WSH","B0541TGTE_SLW","Total green recovery programme expenditure  - Totex - Expenditure in report year - Wastewater network+  Sludge liquor treatment","£m","Cyclical Foundation","",0,0,"","","","","","","","",""]
["WSH","WS01008WR","Operating expenditure - Local authority and Cumulo rates - Water resources","£m","Cyclical Foundation",0.76400000000000001,0.78800000000000003,2.2320000000000002,"","","","","","","","",""]
["WSH","BM317WN","Local authority and Cumulo rates - Water Network+","£m","Cyclical Foundation",15.228,15.504,13.913,"","","","","","","","",""]
["WSH","BM817WNK","Local authority and Cumulo rates - Wastewater Network+","£m","Cyclical Foundation",8.1530000000000005,7.8520000000000003,8.2910000000000004,"","","","","","","","",""]
["WSH","BM817SG","Local authority and Cumulo rates - Sludge","£m","Cyclical Foundation",0.64,0.57199999999999995,0.64,"","","","","","","","",""]
["WSH","BM817TTT","Local authority rates - TTT","£m","Cyclical Foundation","",0,0,"","","","","","","","",""]
["WSH","C_TBC_WR_PR19CA004_OFWAT","Total base costs exclude enhancemnt opex -  Water resources  - OFWAT view","£m","Price Review 2019","","","","","","","","","","","",159.46769046697801]
["WSH","C_TBC_WN_PR19CA004_OFWAT","Total base costs exclude enhancemnt opex -  Water network plus  - OFWAT view","£m","Price Review 2019","","","","","","","","","","","",963.45145267472299]
["WSH","C_TBC_WBR_PR19CA008_OFWAT","Total base costs - Bioresources - OFWAT view","£m","Price Review 2019","","","","","","","","","","","",117.509394302204]
["WSH","C_TBC_WWN_PR19CA008_OFWAT","Total base costs - Wastewater network plus - OFWAT view","£m","Price Review 2019","","","","","","","","","","","",1047.89859656973]
["WSH","C_UBC_WR_PR19CA004_OFWAT","Unmodelled base costs (Local authority and cumulo rates ) -  Water resources - OFWAT view","£m","Price Review 2019","","","","","","","","","","","",2.4895379338241899]
["WSH","C_UBC_WN_PR19CA004_OFWAT","Unmodelled base costs (Local authority and cumulo rates ) -  Water network plus - OFWAT view","£m","Price Review 2019","","","","","","","","","","","",72.021844280840995]
["WSH","C_UBC_WBR_PR19CA008_OFWAT","Base costs - Unmodelled base costs (Local authority and cumulo rates ) -  Bioresources - OFWAT view","£m","Price Review 2019","","","","","","","","","","","",2.4915758880912202]
["WSH","C_UBC_WWN_PR19CA008_OFWAT","Base costs - Unmodelled base costs (Local authority and cumulo rates ) -  Wastewater network plus - OFWAT view","£m","Price Review 2019","","","","","","","","","","","",43.804499200461599]
["WSH","WS1003_WW4_WR","Unmodelled base costs (Abstraction charges / discharge consent) WR","£m","Price Review 2019","","","","","","","","","","","",39.582650515316999]
["WSH","WS1003_WW4_WN","Unmodelled base costs (Abstraction charges / discharge consent) WN","£m","Price Review 2019","","","","","","","","","","","",1.66489564336963]
["WSH","C_WWN_OUTPERFORM_001","Cost sharing rate for outperform","%","Price Review 2019","","","","","","","","","","","",0.41507146635502701]
["WSH","C_WWN_UNDERPERFORM_001","Cost sharing rate for underperform","%","Price Review 2019","","","","","","","","","","","",0.58492853364497299]
["WSH","B0012WR","Abstraction charges/ discharge consents - Water resources","£m","Cyclical Foundation",9.3870000000000005,9.6489999999999991,9.6620000000000008,"","","","","","","","",""]
["WSH","B0012WN","Abstraction charges/ discharge consents - Water Network+","£m","Cyclical Foundation",0.25900000000000001,0.26500000000000001,0.24,"","","","","","","","",""]
["WSH","C_WR_CS_EXANTE_001","Ex-ante allowance above Ofwat forecast - Active - Water Resources","£m","Price Review 2019","","","","","","","","","","","",0]
["WSH","C_WN_CS_EXANTE_001","Ex-ante allowance above Ofwat forecast - Active - Water Network","£m","Price Review 2019","","","","","","","","","","","",0]
["WSH","C_WWN_CS_EXANTE_001","Ex-ante allowance above Ofwat forecast - Active - Wastewater Network","£m","Price Review 2019","","","","","","","","","","","",0]
["WSH","C_WR_WN_OUTPERFORM_001","Cost sharing rate for outperform","%","Price Review 2019","","","","","","","","","","","",0.42655200016616296]
["WSH","C_WR_WN_UNDERPERFORM_001","Cost sharing rate for underperform","%","Price Review 2019","","","","","","","","","","","",0.57344799983383699]
["HDD","B0143TAWR","Totex (net of business rates, abstraction licence fees and grants and contributions) - Total actual totex  (net of business rates, abstraction licence fees and grants and contributions) - 12 months ended 31 March 2021 - Water resources","£m","Cyclical Foundation",9.2629999999999999,3.3130000000000002,4.7112518410000002,"","","","","","","","",""]
["HDD","B0143TAWNP","Totex (net of business rates, abstraction licence fees and grants and contributions) - Total actual totex  (net of business rates, abstraction licence fees and grants and contributions) - 12 months ended 31 March 2021 - Water network plus","£m","Cyclical Foundation",22.001999999999999,23.082999999999998,29.852291126200001,"","","","","","","","",""]
["HDD","B0143TAWWNP","Totex (net of business rates, abstraction licence fees and grants and contributions) - Total actual totex  (net of business rates, abstraction licence fees and grants and contributions) - 12 months ended 31 March 2021 - Wastewater network plus","£m","Cyclical Foundation",4.8490000000000002,6.2569999999999997,7.1662131120000003,"","","","","","","","",""]
["HDD","B0143TATTTH","Totex (net of business rates, abstraction licence fees and grants and contributions) - Total actual totex  (net of business rates, abstraction licence fees and grants and contributions) - 12 months ended 31 March 2021 - Thames Tideway/ Havant Thicket","£m","Cyclical Foundation",0,0,0,"","","","","","","","",""]
["HDD","B0413TGTE_WR","Total green recovery programme expenditure  - Totex - Expenditure in report year - Water resources","£m","Cyclical Foundation","",0,0,"","","","","","","","",""]
["HDD","B0420TGTE_RW","Total green recovery programme expenditure  - Totex - Expenditure in report year - Water network+ Raw water transport","£m","Cyclical Foundation","",0,0,"","","","","","","","",""]
["HDD","B0427TGTE_SW","Total green recovery programme expenditure  - Totex - Expenditure in report year - Water network+ Raw water storage","£m","Cyclical Foundation","",0,0,"","","","","","","","",""]
["HDD","B0434TGTE_TW","Total green recovery programme expenditure  - Totex - Expenditure in report year - Water network+ Water treatment","£m","Cyclical Foundation","",0,0,"","","","","","","","",""]
["HDD","B0441TGTE_DW","Total green recovery programme expenditure  - Totex - Expenditure in report year - Water network+ Treated water distribution","£m","Cyclical Foundation","",0,0,"","","","","","","","",""]
["HDD","B0513TGTE_FOW","Total green recovery programme expenditure  - Totex - Expenditure in report year - Wastewater network+  Foul","£m","Cyclical Foundation","",0,0,"","","","","","","","",""]
["HDD","B0520TGTE_SUW","Total green recovery programme expenditure  - Totex - Expenditure in report year - Wastewater network+  Surface water drainage","£m","Cyclical Foundation","",0,0,"","","","","","","","",""]
["HDD","B0527TGTE_HDW","Total green recovery programme expenditure  - Totex - Expenditure in report year - Wastewater network+  Highway drainage","£m","Cyclical Foundation","",0,0,"","","","","","","","",""]
["HDD","B0534TGTE_STW","Total green recovery programme expenditure  - Totex - Expenditure in report year - Wastewater network+  Sewage treatment and disposal","£m","Cyclical Foundation","",0,0,"","","","","","","","",""]
["HDD","B0541TGTE_SLW","Total green recovery programme expenditure  - Totex - Expenditure in report year - Wastewater network+  Sludge liquor treatment","£m","Cyclical Foundation","",0,0,"","","","","","","","",""]
["HDD","WS01008WR","Operating expenditure - Local authority and Cumulo rates - Water resources","£m","Cyclical Foundation",-0.27800000000000002,-0.52800000000000002,0,"","","","","","","","",""]
["HDD","BM317WN","Local authority and Cumulo rates - Water Network+","£m","Cyclical Foundation",-0.628,1.819,1.2552397609999999,"","","","","","","","",""]
["HDD","BM817WNK","Local authority and Cumulo rates - Wastewater Network+","£m","Cyclical Foundation",0.28699999999999998,0.28599999999999998,0.2645132,"","","","","","","","",""]
["HDD","BM817SG","Local authority and Cumulo rates - Sludge","£m","Cyclical Foundation",0,0,1.2434699999999999E-4,"","","","","","","","",""]
["HDD","BM817TTT","Local authority rates - TTT","£m","Cyclical Foundation","",0,0,"","","","","","","","",""]
["HDD","C_TBC_WR_PR19CA004_OFWAT","Total base costs exclude enhancemnt opex -  Water resources  - OFWAT view","£m","Price Review 2019","","","","","","","","","","","",11.0266151074115]
["HDD","C_TBC_WN_PR19CA004_OFWAT","Total base costs exclude enhancemnt opex -  Water network plus  - OFWAT view","£m","Price Review 2019","","","","","","","","","","","",99.793209050279899]
["HDD","C_TBC_WBR_PR19CA008_OFWAT","Total base costs - Bioresources - OFWAT view","£m","Price Review 2019","","","","","","","","","","","",3.83641296676003]
["HDD","C_TBC_WWN_PR19CA008_OFWAT","Total base costs - Wastewater network plus - OFWAT view","£m","Price Review 2019","","","","","","","","","","","",21.380933086575101]
["HDD","C_UBC_WR_PR19CA004_OFWAT","Unmodelled base costs (Local authority and cumulo rates ) -  Water resources - OFWAT view","£m","Price Review 2019","","","","","","","","","","","",0.71794735578999003]
["HDD","C_UBC_WN_PR19CA004_OFWAT","Unmodelled base costs (Local authority and cumulo rates ) -  Water network plus - OFWAT view","£m","Price Review 2019","","","","","","","","","","","",7.04411016276525]
["HDD","C_UBC_WBR_PR19CA008_OFWAT","Base costs - Unmodelled base costs (Local authority and cumulo rates ) -  Bioresources - OFWAT view","£m","Price Review 2019","","","","","","","","","","","",0.61938268002168795]
["HDD","C_UBC_WWN_PR19CA008_OFWAT","Base costs - Unmodelled base costs (Local authority and cumulo rates ) -  Wastewater network plus - OFWAT view","£m","Price Review 2019","","","","","","","","","","","",0.61938268002168695]
["HDD","WS1003_WW4_WR","Unmodelled base costs (Abstraction charges / discharge consent) WR","£m","Price Review 2019","","","","","","","","","","","",2.2626114398783299]
["HDD","WS1003_WW4_WN","Unmodelled base costs (Abstraction charges / discharge consent) WN","£m","Price Review 2019","","","","","","","","","","","",0]
["HDD","C_WWN_OUTPERFORM_001","Cost sharing rate for outperform","%","Price Review 2019","","","","","","","","","","","",0.59113255715519097]
["HDD","C_WWN_UNDERPERFORM_001","Cost sharing rate for underperform","%","Price Review 2019","","","","","","","","","","","",0.5]
["HDD","B0012WR","Abstraction charges/ discharge consents - Water resources","£m","Cyclical Foundation",0.61,0.59699999999999998,0.75607119499999997,"","","","","","","","",""]
["HDD","B0012WN","Abstraction charges/ discharge consents - Water Network+","£m","Cyclical Foundation",2.5000000000000001E-2,2.7E-2,1.3413253999999999E-2,"","","","","","","","",""]
["HDD","C_WR_CS_EXANTE_001","Ex-ante allowance above Ofwat forecast - Active - Water Resources","£m","Price Review 2019","","","","","","","","","","","",-9.8428878489262003E-2]
["HDD","C_WN_CS_EXANTE_001","Ex-ante allowance above Ofwat forecast - Active - Water Network","£m","Price Review 2019","","","","","","","","","","","",-2.1585601814516799]
["HDD","C_WWN_CS_EXANTE_001","Ex-ante allowance above Ofwat forecast - Active - Wastewater Network","£m","Price Review 2019","","","","","","","","","","","",-0.89491687145602195]
["HDD","C_WR_WN_OUTPERFORM_001","Cost sharing rate for outperform","%","Price Review 2019","","","","","","","","","","","",0.53960055133801299]
["HDD","C_WR_WN_UNDERPERFORM_001","Cost sharing rate for underperform","%","Price Review 2019","","","","","","","","","","","",0.5]
["NES","B0143TAWR","Totex (net of business rates, abstraction licence fees and grants and contributions) - Total actual totex  (net of business rates, abstraction licence fees and grants and contributions) - 12 months ended 31 March 2021 - Water resources","£m","Cyclical Foundation",32.771999999999998,42.356999999999999,55.222999999999999,"","","","","","","","",""]
["NES","B0143TAWNP","Totex (net of business rates, abstraction licence fees and grants and contributions) - Total actual totex  (net of business rates, abstraction licence fees and grants and contributions) - 12 months ended 31 March 2021 - Water network plus","£m","Cyclical Foundation",229.38200000000001,246.529,296.45800000000003,"","","","","","","","",""]
["NES","B0143TAWWNP","Totex (net of business rates, abstraction licence fees and grants and contributions) - Total actual totex  (net of business rates, abstraction licence fees and grants and contributions) - 12 months ended 31 March 2021 - Wastewater network plus","£m","Cyclical Foundation",162.87799999999999,189.14599999999999,206.304,"","","","","","","","",""]
["NES","B0143TATTTH","Totex (net of business rates, abstraction licence fees and grants and contributions) - Total actual totex  (net of business rates, abstraction licence fees and grants and contributions) - 12 months ended 31 March 2021 - Thames Tideway/ Havant Thicket","£m","Cyclical Foundation",0,0,0,"","","","","","","","",""]
["NES","B0413TGTE_WR","Total green recovery programme expenditure  - Totex - Expenditure in report year - Water resources","£m","Cyclical Foundation","",0,0,"","","","","","","","",""]
["NES","B0420TGTE_RW","Total green recovery programme expenditure  - Totex - Expenditure in report year - Water network+ Raw water transport","£m","Cyclical Foundation","",0,0,"","","","","","","","",""]
["NES","B0427TGTE_SW","Total green recovery programme expenditure  - Totex - Expenditure in report year - Water network+ Raw water storage","£m","Cyclical Foundation","",0,0,"","","","","","","","",""]
["NES","B0434TGTE_TW","Total green recovery programme expenditure  - Totex - Expenditure in report year - Water network+ Water treatment","£m","Cyclical Foundation","",0,0,"","","","","","","","",""]
["NES","B0441TGTE_DW","Total green recovery programme expenditure  - Totex - Expenditure in report year - Water network+ Treated water distribution","£m","Cyclical Foundation","",0,0,"","","","","","","","",""]
["NES","B0513TGTE_FOW","Total green recovery programme expenditure  - Totex - Expenditure in report year - Wastewater network+  Foul","£m","Cyclical Foundation","",0,0,"","","","","","","","",""]
["NES","B0520TGTE_SUW","Total green recovery programme expenditure  - Totex - Expenditure in report year - Wastewater network+  Surface water drainage","£m","Cyclical Foundation","",0,0,"","","","","","","","",""]
["NES","B0527TGTE_HDW","Total green recovery programme expenditure  - Totex - Expenditure in report year - Wastewater network+  Highway drainage","£m","Cyclical Foundation","",0,0,"","","","","","","","",""]
["NES","B0534TGTE_STW","Total green recovery programme expenditure  - Totex - Expenditure in report year - Wastewater network+  Sewage treatment and disposal","£m","Cyclical Foundation","",0,0,"","","","","","","","",""]
["NES","B0541TGTE_SLW","Total green recovery programme expenditure  - Totex - Expenditure in report year - Wastewater network+  Sludge liquor treatment","£m","Cyclical Foundation","",0,0,"","","","","","","","",""]
["NES","WS01008WR","Operating expenditure - Local authority and Cumulo rates - Water resources","£m","Cyclical Foundation",4.234,4.2350000000000003,4.2220000000000004,"","","","","","","","",""]
["NES","BM317WN","Local authority and Cumulo rates - Water Network+","£m","Cyclical Foundation",26.68,26.664000000000001,26.940999999999999,"","","","","","","","",""]
["NES","BM817WNK","Local authority and Cumulo rates - Wastewater Network+","£m","Cyclical Foundation",6.95,4.7050000000000001,7.7169999999999996,"","","","","","","","",""]
["NES","BM817SG","Local authority and Cumulo rates - Sludge","£m","Cyclical Foundation",1.4319999999999999,0.95499999999999996,1.615,"","","","","","","","",""]
["NES","BM817TTT","Local authority rates - TTT","£m","Cyclical Foundation","",0,0,"","","","","","","","",""]
["NES","C_TBC_WR_PR19CA004_OFWAT","Total base costs exclude enhancemnt opex -  Water resources  - OFWAT view","£m","Price Review 2019","","","","","","","","","","","",246.326123966475]
["NES","C_TBC_WN_PR19CA004_OFWAT","Total base costs exclude enhancemnt opex -  Water network plus  - OFWAT view","£m","Price Review 2019","","","","","","","","","","","",1212.8576110218]
["NES","C_TBC_WBR_PR19CA008_OFWAT","Total base costs - Bioresources - OFWAT view","£m","Price Review 2019","","","","","","","","","","","",71.767676162125198]
["NES","C_TBC_WWN_PR19CA008_OFWAT","Total base costs - Wastewater network plus - OFWAT view","£m","Price Review 2019","","","","","","","","","","","",799.95991211400894]
["NES","C_UBC_WR_PR19CA004_OFWAT","Unmodelled base costs (Local authority and cumulo rates ) -  Water resources - OFWAT view","£m","Price Review 2019","","","","","","","","","","","",27.1472468696611]
["NES","C_UBC_WN_PR19CA004_OFWAT","Unmodelled base costs (Local authority and cumulo rates ) -  Water network plus - OFWAT view","£m","Price Review 2019","","","","","","","","","","","",171.05809266190099]
["NES","C_UBC_WBR_PR19CA008_OFWAT","Base costs - Unmodelled base costs (Local authority and cumulo rates ) -  Bioresources - OFWAT view","£m","Price Review 2019","","","","","","","","","","","",6.6241100783412596]
["NES","C_UBC_WWN_PR19CA008_OFWAT","Base costs - Unmodelled base costs (Local authority and cumulo rates ) -  Wastewater network plus - OFWAT view","£m","Price Review 2019","","","","","","","","","","","",32.266109365275199]
["NES","WS1003_WW4_WR","Unmodelled base costs (Abstraction charges / discharge consent) WR","£m","Price Review 2019","","","","","","","","","","","",131.33203118954901]
["NES","WS1003_WW4_WN","Unmodelled base costs (Abstraction charges / discharge consent) WN","£m","Price Review 2019","","","","","","","","","","","",1.28518260189936]
["NES","C_WWN_OUTPERFORM_001","Cost sharing rate for outperform","%","Price Review 2019","","","","","","","","","","","",0.34404483772507694]
["NES","C_WWN_UNDERPERFORM_001","Cost sharing rate for underperform","%","Price Review 2019","","","","","","","","","","","",0.65595516227492301]
["NES","B0012WR","Abstraction charges/ discharge consents - Water resources","£m","Cyclical Foundation",43.472999999999999,43.448999999999998,39.564999999999998,"","","","","","","","",""]
["NES","B0012WN","Abstraction charges/ discharge consents - Water Network+","£m","Cyclical Foundation",0.33700000000000002,0.33400000000000002,0.318,"","","","","","","","",""]
["NES","C_WR_CS_EXANTE_001","Ex-ante allowance above Ofwat forecast - Active - Water Resources","£m","Price Review 2019","","","","","","","","","","","",0]
["NES","C_WN_CS_EXANTE_001","Ex-ante allowance above Ofwat forecast - Active - Water Network","£m","Price Review 2019","","","","","","","","","","","",0]
["NES","C_WWN_CS_EXANTE_001","Ex-ante allowance above Ofwat forecast - Active - Wastewater Network","£m","Price Review 2019","","","","","","","","","","","",0]
["NES","C_WR_WN_OUTPERFORM_001","Cost sharing rate for outperform","%","Price Review 2019","","","","","","","","","","","",0.461902471703596]
["NES","C_WR_WN_UNDERPERFORM_001","Cost sharing rate for underperform","%","Price Review 2019","","","","","","","","","","","",0.538097528296404]
["SVE","B0143TAWR","Totex (net of business rates, abstraction licence fees and grants and contributions) - Total actual totex  (net of business rates, abstraction licence fees and grants and contributions) - 12 months ended 31 March 2021 - Water resources","£m","Cyclical Foundation",76.906999999999996,73.454999999999998,74.44,"","","","","","","","",""]
["SVE","B0143TAWNP","Totex (net of business rates, abstraction licence fees and grants and contributions) - Total actual totex  (net of business rates, abstraction licence fees and grants and contributions) - 12 months ended 31 March 2021 - Water network plus","£m","Cyclical Foundation",480.90511744520001,524.01400000000001,622.94100000000003,"","","","","","","","",""]
["SVE","B0143TAWWNP","Totex (net of business rates, abstraction licence fees and grants and contributions) - Total actual totex  (net of business rates, abstraction licence fees and grants and contributions) - 12 months ended 31 March 2021 - Wastewater network plus","£m","Cyclical Foundation",452.62898146499998,506.173,586.48599999999999,"","","","","","","","",""]
["SVE","B0143TATTTH","Totex (net of business rates, abstraction licence fees and grants and contributions) - Total actual totex  (net of business rates, abstraction licence fees and grants and contributions) - 12 months ended 31 March 2021 - Thames Tideway/ Havant Thicket","£m","Cyclical Foundation",0,0,0,"","","","","","","","",""]
["SVE","B0413TGTE_WR","Total green recovery programme expenditure  - Totex - Expenditure in report year - Water resources","£m","Cyclical Foundation","",0.36299999999999999,2.2269999999999999,"","","","","","","","",""]
["SVE","B0420TGTE_RW","Total green recovery programme expenditure  - Totex - Expenditure in report year - Water network+ Raw water transport","£m","Cyclical Foundation","",0,0,"","","","","","","","",""]
["SVE","B0427TGTE_SW","Total green recovery programme expenditure  - Totex - Expenditure in report year - Water network+ Raw water storage","£m","Cyclical Foundation","",0,0,"","","","","","","","",""]
["SVE","B0434TGTE_TW","Total green recovery programme expenditure  - Totex - Expenditure in report year - Water network+ Water treatment","£m","Cyclical Foundation","",4.1340000000000003,35.164999999999999,"","","","","","","","",""]
["SVE","B0441TGTE_DW","Total green recovery programme expenditure  - Totex - Expenditure in report year - Water network+ Treated water distribution","£m","Cyclical Foundation","",3.7090000000000001,23.029,"","","","","","","","",""]
["SVE","B0513TGTE_FOW","Total green recovery programme expenditure  - Totex - Expenditure in report year - Wastewater network+  Foul","£m","Cyclical Foundation","",0,1E-3,"","","","","","","","",""]
["SVE","B0520TGTE_SUW","Total green recovery programme expenditure  - Totex - Expenditure in report year - Wastewater network+  Surface water drainage","£m","Cyclical Foundation","",0.312,3.7959999999999998,"","","","","","","","",""]
["SVE","B0527TGTE_HDW","Total green recovery programme expenditure  - Totex - Expenditure in report year - Wastewater network+  Highway drainage","£m","Cyclical Foundation","",1.25,5.0060000000000002,"","","","","","","","",""]
["SVE","B0534TGTE_STW","Total green recovery programme expenditure  - Totex - Expenditure in report year - Wastewater network+  Sewage treatment and disposal","£m","Cyclical Foundation","",4.1719999999999997,9.9730000000000008,"","","","","","","","",""]
["SVE","B0541TGTE_SLW","Total green recovery programme expenditure  - Totex - Expenditure in report year - Wastewater network+  Sludge liquor treatment","£m","Cyclical Foundation","",0,0,"","","","","","","","",""]
["SVE","WS01008WR","Operating expenditure - Local authority and Cumulo rates - Water resources","£m","Cyclical Foundation",4.51,4.9710000000000001,4.4729999999999999,"","","","","","","","",""]
["SVE","BM317WN","Local authority and Cumulo rates - Water Network+","£m","Cyclical Foundation",47.712000000000003,48.097999999999999,47.804000000000002,"","","","","","","","",""]
["SVE","BM817WNK","Local authority and Cumulo rates - Wastewater Network+","£m","Cyclical Foundation",23.117999999999999,22.84,22.367999999999999,"","","","","","","","",""]
["SVE","BM817SG","Local authority and Cumulo rates - Sludge","£m","Cyclical Foundation",3.2869999999999999,2.9729999999999999,3.0350000000000001,"","","","","","","","",""]
["SVE","BM817TTT","Local authority rates - TTT","£m","Cyclical Foundation","",0,0,"","","","","","","","",""]
["SVE","C_TBC_WR_PR19CA004_OFWAT","Total base costs exclude enhancemnt opex -  Water resources  - OFWAT view","£m","Price Review 2019","","","","","","","","","","","",280.23281840473902]
["SVE","C_TBC_WN_PR19CA004_OFWAT","Total base costs exclude enhancemnt opex -  Water network plus  - OFWAT view","£m","Price Review 2019","","","","","","","","","","","",2183.10931816742]
["SVE","C_TBC_WBR_PR19CA008_OFWAT","Total base costs - Bioresources - OFWAT view","£m","Price Review 2019","","","","","","","","","","","",310.95089707280698]
["SVE","C_TBC_WWN_PR19CA008_OFWAT","Total base costs - Wastewater network plus - OFWAT view","£m","Price Review 2019","","","","","","","","","","","",2332.6215711383802]
["SVE","C_UBC_WR_PR19CA004_OFWAT","Unmodelled base costs (Local authority and cumulo rates ) -  Water resources - OFWAT view","£m","Price Review 2019","","","","","","","","","","","",21.952715652117298]
["SVE","C_UBC_WN_PR19CA004_OFWAT","Unmodelled base costs (Local authority and cumulo rates ) -  Water network plus - OFWAT view","£m","Price Review 2019","","","","","","","","","","","",207.87686875858699]
["SVE","C_UBC_WBR_PR19CA008_OFWAT","Base costs - Unmodelled base costs (Local authority and cumulo rates ) -  Bioresources - OFWAT view","£m","Price Review 2019","","","","","","","","","","","",21.118863293441301]
["SVE","C_UBC_WWN_PR19CA008_OFWAT","Base costs - Unmodelled base costs (Local authority and cumulo rates ) -  Wastewater network plus - OFWAT view","£m","Price Review 2019","","","","","","","","","","","",106.809403616433]
["SVE","WS1003_WW4_WR","Unmodelled base costs (Abstraction charges / discharge consent) WR","£m","Price Review 2019","","","","","","","","","","","",54.3224625227449]
["SVE","WS1003_WW4_WN","Unmodelled base costs (Abstraction charges / discharge consent) WN","£m","Price Review 2019","","","","","","","","","","","",0]
["SVE","C_WWN_OUTPERFORM_001","Cost sharing rate for outperform","%","Price Review 2019","","","","","","","","","","","",0.5]
["SVE","C_WWN_UNDERPERFORM_001","Cost sharing rate for underperform","%","Price Review 2019","","","","","","","","","","","",0.5]
["SVE","B0012WR","Abstraction charges/ discharge consents - Water resources","£m","Cyclical Foundation",11.548999999999999,11.569000000000001,15.236000000000001,"","","","","","","","",""]
["SVE","B0012WN","Abstraction charges/ discharge consents - Water Network+","£m","Cyclical Foundation",0.39800000000000002,0.43,0.53200000000000003,"","","","","","","","",""]
["SVE","C_WR_CS_EXANTE_001","Ex-ante allowance above Ofwat forecast - Active - Water Resources","£m","Price Review 2019","","","","","","","","","","","",0]
["SVE","C_WN_CS_EXANTE_001","Ex-ante allowance above Ofwat forecast - Active - Water Network","£m","Price Review 2019","","","","","","","","","","","",0]
["SVE","C_WWN_CS_EXANTE_001","Ex-ante allowance above Ofwat forecast - Active - Wastewater Network","£m","Price Review 2019","","","","","","","","","","","",0]
["SVE","C_WR_WN_OUTPERFORM_001","Cost sharing rate for outperform","%","Price Review 2019","","","","","","","","","","","",0.5]
["SVE","C_WR_WN_UNDERPERFORM_001","Cost sharing rate for underperform","%","Price Review 2019","","","","","","","","","","","",0.5]
["SWB","B0143TAWR","Totex (net of business rates, abstraction licence fees and grants and contributions) - Total actual totex  (net of business rates, abstraction licence fees and grants and contributions) - 12 months ended 31 March 2021 - Water resources","£m","Cyclical Foundation",12.06,16.814,45.32,"","","","","","","","",""]
["SWB","B0143TAWNP","Totex (net of business rates, abstraction licence fees and grants and contributions) - Total actual totex  (net of business rates, abstraction licence fees and grants and contributions) - 12 months ended 31 March 2021 - Water network plus","£m","Cyclical Foundation",136.47,151.892,218.81700000000001,"","","","","","","","",""]
["SWB","B0143TAWWNP","Totex (net of business rates, abstraction licence fees and grants and contributions) - Total actual totex  (net of business rates, abstraction licence fees and grants and contributions) - 12 months ended 31 March 2021 - Wastewater network plus","£m","Cyclical Foundation",145.571,170.84700000000001,238.239,"","","","","","","","",""]
["SWB","B0143TATTTH","Totex (net of business rates, abstraction licence fees and grants and contributions) - Total actual totex  (net of business rates, abstraction licence fees and grants and contributions) - 12 months ended 31 March 2021 - Thames Tideway/ Havant Thicket","£m","Cyclical Foundation",0,0,0,"","","","","","","","",""]
["SWB","B0413TGTE_WR","Total green recovery programme expenditure  - Totex - Expenditure in report year - Water resources","£m","Cyclical Foundation","",0.92600000000000005,3.5910000000000002,"","","","","","","","",""]
["SWB","B0420TGTE_RW","Total green recovery programme expenditure  - Totex - Expenditure in report year - Water network+ Raw water transport","£m","Cyclical Foundation","",0.123,3.4830000000000001,"","","","","","","","",""]
["SWB","B0427TGTE_SW","Total green recovery programme expenditure  - Totex - Expenditure in report year - Water network+ Raw water storage","£m","Cyclical Foundation","",0,0,"","","","","","","","",""]
["SWB","B0434TGTE_TW","Total green recovery programme expenditure  - Totex - Expenditure in report year - Water network+ Water treatment","£m","Cyclical Foundation","",1.19,1.615,"","","","","","","","",""]
["SWB","B0441TGTE_DW","Total green recovery programme expenditure  - Totex - Expenditure in report year - Water network+ Treated water distribution","£m","Cyclical Foundation","",7.5999999999999998E-2,0.40100000000000002,"","","","","","","","",""]
["SWB","B0513TGTE_FOW","Total green recovery programme expenditure  - Totex - Expenditure in report year - Wastewater network+  Foul","£m","Cyclical Foundation","",6.8000000000000005E-2,0.85199999999999998,"","","","","","","","",""]
["SWB","B0520TGTE_SUW","Total green recovery programme expenditure  - Totex - Expenditure in report year - Wastewater network+  Surface water drainage","£m","Cyclical Foundation","",1.7999999999999999E-2,0.224,"","","","","","","","",""]
["SWB","B0527TGTE_HDW","Total green recovery programme expenditure  - Totex - Expenditure in report year - Wastewater network+  Highway drainage","£m","Cyclical Foundation","",4.0000000000000001E-3,4.4999999999999998E-2,"","","","","","","","",""]
["SWB","B0534TGTE_STW","Total green recovery programme expenditure  - Totex - Expenditure in report year - Wastewater network+  Sewage treatment and disposal","£m","Cyclical Foundation","",0,0,"","","","","","","","",""]
["SWB","B0541TGTE_SLW","Total green recovery programme expenditure  - Totex - Expenditure in report year - Wastewater network+  Sludge liquor treatment","£m","Cyclical Foundation","",0,0,"","","","","","","","",""]
["SWB","WS01008WR","Operating expenditure - Local authority and Cumulo rates - Water resources","£m","Cyclical Foundation",2.0510000000000002,2.206,2.2000000000000002,"","","","","","","","",""]
["SWB","BM317WN","Local authority and Cumulo rates - Water Network+","£m","Cyclical Foundation",19.376000000000001,20.837,20.791,"","","","","","","","",""]
["SWB","BM817WNK","Local authority and Cumulo rates - Wastewater Network+","£m","Cyclical Foundation",4.8869999999999996,5.1449999999999996,4.9539999999999997,"","","","","","","","",""]
["SWB","BM817SG","Local authority and Cumulo rates - Sludge","£m","Cyclical Foundation",0.70699999999999996,1.401,1.4139999999999999,"","","","","","","","",""]
["SWB","BM817TTT","Local authority rates - TTT","£m","Cyclical Foundation","",0,0,"","","","","","","","",""]
["SWB","C_TBC_WR_PR19CA004_OFWAT","Total base costs exclude enhancemnt opex -  Water resources  - OFWAT view","£m","Price Review 2019","","","","","","","","","","","",64.5966502187853]
["SWB","C_TBC_WN_PR19CA004_OFWAT","Total base costs exclude enhancemnt opex -  Water network plus  - OFWAT view","£m","Price Review 2019","","","","","","","","","","","",709.28828211428697]
["SWB","C_TBC_WBR_PR19CA008_OFWAT","Total base costs - Bioresources - OFWAT view","£m","Price Review 2019","","","","","","","","","","","",90.542588685309298]
["SWB","C_TBC_WWN_PR19CA008_OFWAT","Total base costs - Wastewater network plus - OFWAT view","£m","Price Review 2019","","","","","","","","","","","",676.62796984920396]
["SWB","C_UBC_WR_PR19CA004_OFWAT","Unmodelled base costs (Local authority and cumulo rates ) -  Water resources - OFWAT view","£m","Price Review 2019","","","","","","","","","","","",8.2959536449051594]
["SWB","C_UBC_WN_PR19CA004_OFWAT","Unmodelled base costs (Local authority and cumulo rates ) -  Water network plus - OFWAT view","£m","Price Review 2019","","","","","","","","","","","",95.703553921067495]
["SWB","C_UBC_WBR_PR19CA008_OFWAT","Base costs - Unmodelled base costs (Local authority and cumulo rates ) -  Bioresources - OFWAT view","£m","Price Review 2019","","","","","","","","","","","",3.5829644832961698]
["SWB","C_UBC_WWN_PR19CA008_OFWAT","Base costs - Unmodelled base costs (Local authority and cumulo rates ) -  Wastewater network plus - OFWAT view","£m","Price Review 2019","","","","","","","","","","","",26.517769223967399]
["SWB","WS1003_WW4_WR","Unmodelled base costs (Abstraction charges / discharge consent) WR","£m","Price Review 2019","","","","","","","","","","","",23.079737559109301]
["SWB","WS1003_WW4_WN","Unmodelled base costs (Abstraction charges / discharge consent) WN","£m","Price Review 2019","","","","","","","","","","","",1.9375101346816099]
["SWB","C_WWN_OUTPERFORM_001","Cost sharing rate for outperform","%","Price Review 2019","","","","","","","","","","","",0.5]
["SWB","C_WWN_UNDERPERFORM_001","Cost sharing rate for underperform","%","Price Review 2019","","","","","","","","","","","",0.5]
["SWB","B0012WR","Abstraction charges/ discharge consents - Water resources","£m","Cyclical Foundation",4.8099999999999996,4.7990000000000004,5.4989999999999997,"","","","","","","","",""]
["SWB","B0012WN","Abstraction charges/ discharge consents - Water Network+","£m","Cyclical Foundation",0.313,0.32800000000000001,0.51900000000000002,"","","","","","","","",""]
["SWB","C_WR_CS_EXANTE_001","Ex-ante allowance above Ofwat forecast - Active - Water Resources","£m","Price Review 2019","","","","","","","","","","","",0]
["SWB","C_WN_CS_EXANTE_001","Ex-ante allowance above Ofwat forecast - Active - Water Network","£m","Price Review 2019","","","","","","","","","","","",0]
["SWB","C_WWN_CS_EXANTE_001","Ex-ante allowance above Ofwat forecast - Active - Wastewater Network","£m","Price Review 2019","","","","","","","","","","","",0]
["SWB","C_WR_WN_OUTPERFORM_001","Cost sharing rate for outperform","%","Price Review 2019","","","","","","","","","","","",0.5]
["SWB","C_WR_WN_UNDERPERFORM_001","Cost sharing rate for underperform","%","Price Review 2019","","","","","","","","","","","",0.5]
["SRN","B0143TAWR","Totex (net of business rates, abstraction licence fees and grants and contributions) - Total actual totex  (net of business rates, abstraction licence fees and grants and contributions) - 12 months ended 31 March 2021 - Water resources","£m","Cyclical Foundation",30.033000000000001,28.454000000000001,22.739000000000001,"","","","","","","","",""]
["SRN","B0143TAWNP","Totex (net of business rates, abstraction licence fees and grants and contributions) - Total actual totex  (net of business rates, abstraction licence fees and grants and contributions) - 12 months ended 31 March 2021 - Water network plus","£m","Cyclical Foundation",175.292,244.77500000000001,318.97000000000003,"","","","","","","","",""]
["SRN","B0143TAWWNP","Totex (net of business rates, abstraction licence fees and grants and contributions) - Total actual totex  (net of business rates, abstraction licence fees and grants and contributions) - 12 months ended 31 March 2021 - Wastewater network plus","£m","Cyclical Foundation",369.64699999999999,520.19000000000005,621.25699999999995,"","","","","","","","",""]
["SRN","B0143TATTTH","Totex (net of business rates, abstraction licence fees and grants and contributions) - Total actual totex  (net of business rates, abstraction licence fees and grants and contributions) - 12 months ended 31 March 2021 - Thames Tideway/ Havant Thicket","£m","Cyclical Foundation",0,0,0,"","","","","","","","",""]
["SRN","B0413TGTE_WR","Total green recovery programme expenditure  - Totex - Expenditure in report year - Water resources","£m","Cyclical Foundation","",0,0,"","","","","","","","",""]
["SRN","B0420TGTE_RW","Total green recovery programme expenditure  - Totex - Expenditure in report year - Water network+ Raw water transport","£m","Cyclical Foundation","",0,0,"","","","","","","","",""]
["SRN","B0427TGTE_SW","Total green recovery programme expenditure  - Totex - Expenditure in report year - Water network+ Raw water storage","£m","Cyclical Foundation","",0,0,"","","","","","","","",""]
["SRN","B0434TGTE_TW","Total green recovery programme expenditure  - Totex - Expenditure in report year - Water network+ Water treatment","£m","Cyclical Foundation","",0,0,"","","","","","","","",""]
["SRN","B0441TGTE_DW","Total green recovery programme expenditure  - Totex - Expenditure in report year - Water network+ Treated water distribution","£m","Cyclical Foundation","",0,0,"","","","","","","","",""]
["SRN","B0513TGTE_FOW","Total green recovery programme expenditure  - Totex - Expenditure in report year - Wastewater network+  Foul","£m","Cyclical Foundation","",0,0,"","","","","","","","",""]
["SRN","B0520TGTE_SUW","Total green recovery programme expenditure  - Totex - Expenditure in report year - Wastewater network+  Surface water drainage","£m","Cyclical Foundation","",0,0,"","","","","","","","",""]
["SRN","B0527TGTE_HDW","Total green recovery programme expenditure  - Totex - Expenditure in report year - Wastewater network+  Highway drainage","£m","Cyclical Foundation","",0,0,"","","","","","","","",""]
["SRN","B0534TGTE_STW","Total green recovery programme expenditure  - Totex - Expenditure in report year - Wastewater network+  Sewage treatment and disposal","£m","Cyclical Foundation","",0,0,"","","","","","","","",""]
["SRN","B0541TGTE_SLW","Total green recovery programme expenditure  - Totex - Expenditure in report year - Wastewater network+  Sludge liquor treatment","£m","Cyclical Foundation","",0,0,"","","","","","","","",""]
["SRN","WS01008WR","Operating expenditure - Local authority and Cumulo rates - Water resources","£m","Cyclical Foundation",0.80200000000000005,0.999,0.999,"","","","","","","","",""]
["SRN","BM317WN","Local authority and Cumulo rates - Water Network+","£m","Cyclical Foundation",9.0640000000000001,11.289,11.295999999999999,"","","","","","","","",""]
["SRN","BM817WNK","Local authority and Cumulo rates - Wastewater Network+","£m","Cyclical Foundation",13.246,13.391999999999999,13.355,"","","","","","","","",""]
["SRN","BM817SG","Local authority and Cumulo rates - Sludge","£m","Cyclical Foundation",1.7370000000000001,1.758,1.75,"","","","","","","","",""]
["SRN","BM817TTT","Local authority rates - TTT","£m","Cyclical Foundation",0,0,0,"","","","","","","","",""]
["SRN","C_TBC_WR_PR19CA004_OFWAT","Total base costs exclude enhancemnt opex -  Water resources  - OFWAT view","£m","Price Review 2019","","","","","","","","","","","",72.3303530384282]
["SRN","C_TBC_WN_PR19CA004_OFWAT","Total base costs exclude enhancemnt opex -  Water network plus  - OFWAT view","£m","Price Review 2019","","","","","","","","","","","",681.90866511289096]
["SRN","C_TBC_WBR_PR19CA008_OFWAT","Total base costs - Bioresources - OFWAT view","£m","Price Review 2019","","","","","","","","","","","",192.68915926633099]
["SRN","C_TBC_WWN_PR19CA008_OFWAT","Total base costs - Wastewater network plus - OFWAT view","£m","Price Review 2019","","","","","","","","","","","",1437.25759501275]
["SRN","C_UBC_WR_PR19CA004_OFWAT","Unmodelled base costs (Local authority and cumulo rates ) -  Water resources - OFWAT view","£m","Price Review 2019","","","","","","","","","","","",4.3041324057433901]
["SRN","C_UBC_WN_PR19CA004_OFWAT","Unmodelled base costs (Local authority and cumulo rates ) -  Water network plus - OFWAT view","£m","Price Review 2019","","","","","","","","","","","",51.659728167874199]
["SRN","C_UBC_WBR_PR19CA008_OFWAT","Base costs - Unmodelled base costs (Local authority and cumulo rates ) -  Bioresources - OFWAT view","£m","Price Review 2019","","","","","","","","","","","",6.1330811247696699]
["SRN","C_UBC_WWN_PR19CA008_OFWAT","Base costs - Unmodelled base costs (Local authority and cumulo rates ) -  Wastewater network plus - OFWAT view","£m","Price Review 2019","","","","","","","","","","","",58.904947516804]
["SRN","WS1003_WW4_WR","Unmodelled base costs (Abstraction charges / discharge consent) WR","£m","Price Review 2019","","","","","","","","","","","",22.656211474392499]
["SRN","WS1003_WW4_WN","Unmodelled base costs (Abstraction charges / discharge consent) WN","£m","Price Review 2019","","","","","","","","","","","",0]
["SRN","C_WWN_OUTPERFORM_001","Cost sharing rate for outperform","%","Price Review 2019","","","","","","","","","","","",0.36076459726604798]
["SRN","C_WWN_UNDERPERFORM_001","Cost sharing rate for underperform","%","Price Review 2019","","","","","","","","","","","",0.63923540273395196]
["SRN","B0012WR","Abstraction charges/ discharge consents - Water resources","£m","Cyclical Foundation",3.891,3.665,4.1440000000000001,"","","","","","","","",""]
["SRN","B0012WN","Abstraction charges/ discharge consents - Water Network+","£m","Cyclical Foundation",9.6000000000000002E-2,9.9000000000000005E-2,0.1,"","","","","","","","",""]
["SRN","C_WR_CS_EXANTE_001","Ex-ante allowance above Ofwat forecast - Active - Water Resources","£m","Price Review 2019","","","","","","","","","","","",0]
["SRN","C_WN_CS_EXANTE_001","Ex-ante allowance above Ofwat forecast - Active - Water Network","£m","Price Review 2019","","","","","","","","","","","",0]
["SRN","C_WWN_CS_EXANTE_001","Ex-ante allowance above Ofwat forecast - Active - Wastewater Network","£m","Price Review 2019","","","","","","","","","","","",0]
["SRN","C_WR_WN_OUTPERFORM_001","Cost sharing rate for outperform","%","Price Review 2019","","","","","","","","","","","",0.36447859829587698]
["SRN","C_WR_WN_UNDERPERFORM_001","Cost sharing rate for underperform","%","Price Review 2019","","","","","","","","","","","",0.63552140170412297]
["TMS","B0143TAWR","Totex (net of business rates, abstraction licence fees and grants and contributions) - Total actual totex  (net of business rates, abstraction licence fees and grants and contributions) - 12 months ended 31 March 2021 - Water resources","£m","Cyclical Foundation",66.795000000000002,80.703999999999994,78.869,"","","","","","","","",""]
["TMS","B0143TAWNP","Totex (net of business rates, abstraction licence fees and grants and contributions) - Total actual totex  (net of business rates, abstraction licence fees and grants and contributions) - 12 months ended 31 March 2021 - Water network plus","£m","Cyclical Foundation",809.00099999999998,867.49800000000005,1041.145,"","","","","","","","",""]
["TMS","B0143TAWWNP","Totex (net of business rates, abstraction licence fees and grants and contributions) - Total actual totex  (net of business rates, abstraction licence fees and grants and contributions) - 12 months ended 31 March 2021 - Wastewater network plus","£m","Cyclical Foundation",633.15599999999995,748.55899999999997,944.79100000000005,"","","","","","","","",""]
["TMS","B0143TATTTH","Totex (net of business rates, abstraction licence fees and grants and contributions) - Total actual totex  (net of business rates, abstraction licence fees and grants and contributions) - 12 months ended 31 March 2021 - Thames Tideway/ Havant Thicket","£m","Cyclical Foundation",19.248999999999999,29.329000000000001,33.323999999999998,"","","","","","","","",""]
["TMS","B0413TGTE_WR","Total green recovery programme expenditure  - Totex - Expenditure in report year - Water resources","£m","Cyclical Foundation","",0,0,"","","","","","","","",""]
["TMS","B0420TGTE_RW","Total green recovery programme expenditure  - Totex - Expenditure in report year - Water network+ Raw water transport","£m","Cyclical Foundation","",0,0,"","","","","","","","",""]
["TMS","B0427TGTE_SW","Total green recovery programme expenditure  - Totex - Expenditure in report year - Water network+ Raw water storage","£m","Cyclical Foundation","",0,0,"","","","","","","","",""]
["TMS","B0434TGTE_TW","Total green recovery programme expenditure  - Totex - Expenditure in report year - Water network+ Water treatment","£m","Cyclical Foundation","",0,0,"","","","","","","","",""]
["TMS","B0441TGTE_DW","Total green recovery programme expenditure  - Totex - Expenditure in report year - Water network+ Treated water distribution","£m","Cyclical Foundation","",0,1.0620000000000001,"","","","","","","","",""]
["TMS","B0513TGTE_FOW","Total green recovery programme expenditure  - Totex - Expenditure in report year - Wastewater network+  Foul","£m","Cyclical Foundation","",0,0,"","","","","","","","",""]
["TMS","B0520TGTE_SUW","Total green recovery programme expenditure  - Totex - Expenditure in report year - Wastewater network+  Surface water drainage","£m","Cyclical Foundation","",0,0,"","","","","","","","",""]
["TMS","B0527TGTE_HDW","Total green recovery programme expenditure  - Totex - Expenditure in report year - Wastewater network+  Highway drainage","£m","Cyclical Foundation","",0,0,"","","","","","","","",""]
["TMS","B0534TGTE_STW","Total green recovery programme expenditure  - Totex - Expenditure in report year - Wastewater network+  Sewage treatment and disposal","£m","Cyclical Foundation","",0,0,"","","","","","","","",""]
["TMS","B0541TGTE_SLW","Total green recovery programme expenditure  - Totex - Expenditure in report year - Wastewater network+  Sludge liquor treatment","£m","Cyclical Foundation","",0,0,"","","","","","","","",""]
["TMS","WS01008WR","Operating expenditure - Local authority and Cumulo rates - Water resources","£m","Cyclical Foundation",3.8069999999999999,4.7519999999999998,3.3239999999999998,"","","","","","","","",""]
["TMS","BM317WN","Local authority and Cumulo rates - Water Network+","£m","Cyclical Foundation",79.034000000000006,49.743000000000002,68,"","","","","","","","",""]
["TMS","BM817WNK","Local authority and Cumulo rates - Wastewater Network+","£m","Cyclical Foundation",37.65,25.771000000000001,43.67,"","","","","","","","",""]
["TMS","BM817SG","Local authority and Cumulo rates - Sludge","£m","Cyclical Foundation",0.47699999999999998,6.335,0.499,"","","","","","","","",""]
["TMS","BM817TTT","Local authority rates - TTT","£m","Cyclical Foundation",0,0,0,"","","","","","","","",""]
["TMS","C_TBC_WR_PR19CA004_OFWAT","Total base costs exclude enhancemnt opex -  Water resources  - OFWAT view","£m","Price Review 2019","","","","","","","","","","","",342.35834468158703]
["TMS","C_TBC_WN_PR19CA004_OFWAT","Total base costs exclude enhancemnt opex -  Water network plus  - OFWAT view","£m","Price Review 2019","","","","","","","","","","","",3357.7962049441599]
["TMS","C_TBC_WBR_PR19CA008_OFWAT","Total base costs - Bioresources - OFWAT view","£m","Price Review 2019","","","","","","","","","","","",583.33004375478799]
["TMS","C_TBC_WWN_PR19CA008_OFWAT","Total base costs - Wastewater network plus - OFWAT view","£m","Price Review 2019","","","","","","","","","","","",3413.8259429657601]
["TMS","C_UBC_WR_PR19CA004_OFWAT","Unmodelled base costs (Local authority and cumulo rates ) -  Water resources - OFWAT view","£m","Price Review 2019","","","","","","","","","","","",17.0056612244009]
["TMS","C_UBC_WN_PR19CA004_OFWAT","Unmodelled base costs (Local authority and cumulo rates ) -  Water network plus - OFWAT view","£m","Price Review 2019","","","","","","","","","","","",352.64729700196301]
["TMS","C_UBC_WBR_PR19CA008_OFWAT","Base costs - Unmodelled base costs (Local authority and cumulo rates ) -  Bioresources - OFWAT view","£m","Price Review 2019","","","","","","","","","","","",45.340367252052197]
["TMS","C_UBC_WWN_PR19CA008_OFWAT","Base costs - Unmodelled base costs (Local authority and cumulo rates ) -  Wastewater network plus - OFWAT view","£m","Price Review 2019","","","","","","","","","","","",131.28281258687201]
["TMS","WS1003_WW4_WR","Unmodelled base costs (Abstraction charges / discharge consent) WR","£m","Price Review 2019","","","","","","","","","","","",64.6489986033082]
["TMS","WS1003_WW4_WN","Unmodelled base costs (Abstraction charges / discharge consent) WN","£m","Price Review 2019","","","","","","","","","","","",0.38330565983781401]
["TMS","C_WWN_OUTPERFORM_001","Cost sharing rate for outperform","%","Price Review 2019","","","","","","","","","","","",0.44221232134337496]
["TMS","C_WWN_UNDERPERFORM_001","Cost sharing rate for underperform","%","Price Review 2019","","","","","","","","","","","",0.75]
["TMS","B0012WR","Abstraction charges/ discharge consents - Water resources","£m","Cyclical Foundation",17.129000000000001,17.003,23.579000000000001,"","","","","","","","",""]
["TMS","B0012WN","Abstraction charges/ discharge consents - Water Network+","£m","Cyclical Foundation",0,0,0,"","","","","","","","",""]
["TMS","C_WR_CS_EXANTE_001","Ex-ante allowance above Ofwat forecast - Active - Water Resources","£m","Price Review 2019","","","","","","","","","","","",0]
["TMS","C_WN_CS_EXANTE_001","Ex-ante allowance above Ofwat forecast - Active - Water Network","£m","Price Review 2019","","","","","","","","","","","",0]
["TMS","C_WWN_CS_EXANTE_001","Ex-ante allowance above Ofwat forecast - Active - Wastewater Network","£m","Price Review 2019","","","","","","","","","","","",0]
["TMS","C_WR_WN_OUTPERFORM_001","Cost sharing rate for outperform","%","Price Review 2019","","","","","","","","","","","",0.32270460950728297]
["TMS","C_WR_WN_UNDERPERFORM_001","Cost sharing rate for underperform","%","Price Review 2019","","","","","","","","","","","",0.75]
["NWT","B0143TAWR","Totex (net of business rates, abstraction licence fees and grants and contributions) - Total actual totex  (net of business rates, abstraction licence fees and grants and contributions) - 12 months ended 31 March 2021 - Water resources","£m","Cyclical Foundation",34.512078341594098,43.2059664272373,49.472048790141102,"","","","","","","","",""]
["NWT","B0143TAWNP","Totex (net of business rates, abstraction licence fees and grants and contributions) - Total actual totex  (net of business rates, abstraction licence fees and grants and contributions) - 12 months ended 31 March 2021 - Water network plus","£m","Cyclical Foundation",505.76258962361101,494.34166883121401,564.176988398106,"","","","","","","","",""]
["NWT","B0143TAWWNP","Totex (net of business rates, abstraction licence fees and grants and contributions) - Total actual totex  (net of business rates, abstraction licence fees and grants and contributions) - 12 months ended 31 March 2021 - Wastewater network plus","£m","Cyclical Foundation",560.74141814112397,608.10800307824502,676.98243080965506,"","","","","","","","",""]
["NWT","B0143TATTTH","Totex (net of business rates, abstraction licence fees and grants and contributions) - Total actual totex  (net of business rates, abstraction licence fees and grants and contributions) - 12 months ended 31 March 2021 - Thames Tideway/ Havant Thicket","£m","Cyclical Foundation",0,0,0,"","","","","","","","",""]
["NWT","B0413TGTE_WR","Total green recovery programme expenditure  - Totex - Expenditure in report year - Water resources","£m","Cyclical Foundation","",0.10849019999999999,0.30387307000000002,"","","","","","","","",""]
["NWT","B0420TGTE_RW","Total green recovery programme expenditure  - Totex - Expenditure in report year - Water network+ Raw water transport","£m","Cyclical Foundation","",0,0,"","","","","","","","",""]
["NWT","B0427TGTE_SW","Total green recovery programme expenditure  - Totex - Expenditure in report year - Water network+ Raw water storage","£m","Cyclical Foundation","",0,0,"","","","","","","","",""]
["NWT","B0434TGTE_TW","Total green recovery programme expenditure  - Totex - Expenditure in report year - Water network+ Water treatment","£m","Cyclical Foundation","",0,0,"","","","","","","","",""]
["NWT","B0441TGTE_DW","Total green recovery programme expenditure  - Totex - Expenditure in report year - Water network+ Treated water distribution","£m","Cyclical Foundation","",0,0,"","","","","","","","",""]
["NWT","B0513TGTE_FOW","Total green recovery programme expenditure  - Totex - Expenditure in report year - Wastewater network+  Foul","£m","Cyclical Foundation","",5.1334964300000001E-2,0.49151249149999998,"","","","","","","","",""]
["NWT","B0520TGTE_SUW","Total green recovery programme expenditure  - Totex - Expenditure in report year - Wastewater network+  Surface water drainage","£m","Cyclical Foundation","",5.3114159038300003E-2,0.47812600423149998,"","","","","","","","",""]
["NWT","B0527TGTE_HDW","Total green recovery programme expenditure  - Totex - Expenditure in report year - Wastewater network+  Highway drainage","£m","Cyclical Foundation","",2.0758106661699999E-2,0.18686148426849999,"","","","","","","","",""]
["NWT","B0534TGTE_STW","Total green recovery programme expenditure  - Totex - Expenditure in report year - Wastewater network+  Sewage treatment and disposal","£m","Cyclical Foundation","",0.31259058000000001,1.50896823,"","","","","","","","",""]
["NWT","B0541TGTE_SLW","Total green recovery programme expenditure  - Totex - Expenditure in report year - Wastewater network+  Sludge liquor treatment","£m","Cyclical Foundation","",0,0,"","","","","","","","",""]
["NWT","WS01008WR","Operating expenditure - Local authority and Cumulo rates - Water resources","£m","Cyclical Foundation",17.484269186027799,17.406358706399399,17.361323490780499,"","","","","","","","",""]
["NWT","BM317WN","Local authority and Cumulo rates - Water Network+","£m","Cyclical Foundation",46.912235146127998,47.034191282362201,47.037553393025298,"","","","","","","","",""]
["NWT","BM817WNK","Local authority and Cumulo rates - Wastewater Network+","£m","Cyclical Foundation",18.479791926957802,19.1632831333858,16.8162344538509,"","","","","","","","",""]
["NWT","BM817SG","Local authority and Cumulo rates - Sludge","£m","Cyclical Foundation",5.8271471490031503,6.0349843651920603,5.50016647546608,"","","","","","","","",""]
["NWT","BM817TTT","Local authority rates - TTT","£m","Cyclical Foundation","",0,0,"","","","","","","","",""]
["NWT","C_TBC_WR_PR19CA004_OFWAT","Total base costs exclude enhancemnt opex -  Water resources  - OFWAT view","£m","Price Review 2019","","","","","","","","","","","",360.66322630007897]
["NWT","C_TBC_WN_PR19CA004_OFWAT","Total base costs exclude enhancemnt opex -  Water network plus  - OFWAT view","£m","Price Review 2019","","","","","","","","","","","",1946.1599330235899]
["NWT","C_TBC_WBR_PR19CA008_OFWAT","Total base costs - Bioresources - OFWAT view","£m","Price Review 2019","","","","","","","","","","","",356.544121728177]
["NWT","C_TBC_WWN_PR19CA008_OFWAT","Total base costs - Wastewater network plus - OFWAT view","£m","Price Review 2019","","","","","","","","","","","",1839.1619720410599]
["NWT","C_UBC_WR_PR19CA004_OFWAT","Unmodelled base costs (Local authority and cumulo rates ) -  Water resources - OFWAT view","£m","Price Review 2019","","","","","","","","","","","",85.201741702138904]
["NWT","C_UBC_WN_PR19CA004_OFWAT","Unmodelled base costs (Local authority and cumulo rates ) -  Water network plus - OFWAT view","£m","Price Review 2019","","","","","","","","","","","",223.32987922425801]
["NWT","C_UBC_WBR_PR19CA008_OFWAT","Base costs - Unmodelled base costs (Local authority and cumulo rates ) -  Bioresources - OFWAT view","£m","Price Review 2019","","","","","","","","","","","",29.024745533594199]
["NWT","C_UBC_WWN_PR19CA008_OFWAT","Base costs - Unmodelled base costs (Local authority and cumulo rates ) -  Wastewater network plus - OFWAT view","£m","Price Review 2019","","","","","","","","","","","",99.063964307387394]
["NWT","WS1003_WW4_WR","Unmodelled base costs (Abstraction charges / discharge consent) WR","£m","Price Review 2019","","","","","","","","","","","",80.633391856264197]
["NWT","WS1003_WW4_WN","Unmodelled base costs (Abstraction charges / discharge consent) WN","£m","Price Review 2019","","","","","","","","","","","",1.4738186483043101]
["NWT","C_WWN_OUTPERFORM_001","Cost sharing rate for outperform","%","Price Review 2019","","","","","","","","","","","",0.5]
["NWT","C_WWN_UNDERPERFORM_001","Cost sharing rate for underperform","%","Price Review 2019","","","","","","","","","","","",0.5]
["NWT","B0012WR","Abstraction charges/ discharge consents - Water resources","£m","Cyclical Foundation",17.1594859,17.339695519999999,24.7436699,"","","","","","","","",""]
["NWT","B0012WN","Abstraction charges/ discharge consents - Water Network+","£m","Cyclical Foundation",0.26297660698417002,0.18426267249717701,0.31529720910001002,"","","","","","","","",""]
["NWT","C_WR_CS_EXANTE_001","Ex-ante allowance above Ofwat forecast - Active - Water Resources","£m","Price Review 2019","","","","","","","","","","","",0]
["NWT","C_WN_CS_EXANTE_001","Ex-ante allowance above Ofwat forecast - Active - Water Network","£m","Price Review 2019","","","","","","","","","","","",0]
["NWT","C_WWN_CS_EXANTE_001","Ex-ante allowance above Ofwat forecast - Active - Wastewater Network","£m","Price Review 2019","","","","","","","","","","","",0]
["NWT","C_WR_WN_OUTPERFORM_001","Cost sharing rate for outperform","%","Price Review 2019","","","","","","","","","","","",0.5]
["NWT","C_WR_WN_UNDERPERFORM_001","Cost sharing rate for underperform","%","Price Review 2019","","","","","","","","","","","",0.5]
["WSX","B0143TAWR","Totex (net of business rates, abstraction licence fees and grants and contributions) - Total actual totex  (net of business rates, abstraction licence fees and grants and contributions) - 12 months ended 31 March 2021 - Water resources","£m","Cyclical Foundation",9.2840000000000007,10.571,13.189,"","","","","","","","",""]
["WSX","B0143TAWNP","Totex (net of business rates, abstraction licence fees and grants and contributions) - Total actual totex  (net of business rates, abstraction licence fees and grants and contributions) - 12 months ended 31 March 2021 - Water network plus","£m","Cyclical Foundation",119.90600000000001,118.23,129.85499999999999,"","","","","","","","",""]
["WSX","B0143TAWWNP","Totex (net of business rates, abstraction licence fees and grants and contributions) - Total actual totex  (net of business rates, abstraction licence fees and grants and contributions) - 12 months ended 31 March 2021 - Wastewater network plus","£m","Cyclical Foundation",237.078,235.87299999999999,264.79599999999999,"","","","","","","","",""]
["WSX","B0143TATTTH","Totex (net of business rates, abstraction licence fees and grants and contributions) - Total actual totex  (net of business rates, abstraction licence fees and grants and contributions) - 12 months ended 31 March 2021 - Thames Tideway/ Havant Thicket","£m","Cyclical Foundation",0,0,0,"","","","","","","","",""]
["WSX","B0413TGTE_WR","Total green recovery programme expenditure  - Totex - Expenditure in report year - Water resources","£m","Cyclical Foundation","",0,0,"","","","","","","","",""]
["WSX","B0420TGTE_RW","Total green recovery programme expenditure  - Totex - Expenditure in report year - Water network+ Raw water transport","£m","Cyclical Foundation","",0,0,"","","","","","","","",""]
["WSX","B0427TGTE_SW","Total green recovery programme expenditure  - Totex - Expenditure in report year - Water network+ Raw water storage","£m","Cyclical Foundation","",0,0,"","","","","","","","",""]
["WSX","B0434TGTE_TW","Total green recovery programme expenditure  - Totex - Expenditure in report year - Water network+ Water treatment","£m","Cyclical Foundation","",0,0,"","","","","","","","",""]
["WSX","B0441TGTE_DW","Total green recovery programme expenditure  - Totex - Expenditure in report year - Water network+ Treated water distribution","£m","Cyclical Foundation","",0,0,"","","","","","","","",""]
["WSX","B0513TGTE_FOW","Total green recovery programme expenditure  - Totex - Expenditure in report year - Wastewater network+  Foul","£m","Cyclical Foundation","",0,0,"","","","","","","","",""]
["WSX","B0520TGTE_SUW","Total green recovery programme expenditure  - Totex - Expenditure in report year - Wastewater network+  Surface water drainage","£m","Cyclical Foundation","",0,0,"","","","","","","","",""]
["WSX","B0527TGTE_HDW","Total green recovery programme expenditure  - Totex - Expenditure in report year - Wastewater network+  Highway drainage","£m","Cyclical Foundation","",0,0,"","","","","","","","",""]
["WSX","B0534TGTE_STW","Total green recovery programme expenditure  - Totex - Expenditure in report year - Wastewater network+  Sewage treatment and disposal","£m","Cyclical Foundation","",0,0,"","","","","","","","",""]
["WSX","B0541TGTE_SLW","Total green recovery programme expenditure  - Totex - Expenditure in report year - Wastewater network+  Sludge liquor treatment","£m","Cyclical Foundation","",0,0,"","","","","","","","",""]
["WSX","WS01008WR","Operating expenditure - Local authority and Cumulo rates - Water resources","£m","Cyclical Foundation",0.96764071120538497,0.96138774503593805,0.97399999999999998,"","","","","","","","",""]
["WSX","BM317WN","Local authority and Cumulo rates - Water Network+","£m","Cyclical Foundation",15.0517525785476,14.929807562819301,14.994,"","","","","","","","",""]
["WSX","BM817WNK","Local authority and Cumulo rates - Wastewater Network+","£m","Cyclical Foundation",7.1502332510739697,7.1476199182773197,7.1479999999999997,"","","","","","","","",""]
["WSX","BM817SG","Local authority and Cumulo rates - Sludge","£m","Cyclical Foundation",1.64603258293165,1.61860586852216,1.6140000000000001,"","","","","","","","",""]
["WSX","BM817TTT","Local authority rates - TTT","£m","Cyclical Foundation",0,0,0,"","","","","","","","",""]
["WSX","C_TBC_WR_PR19CA004_OFWAT","Total base costs exclude enhancemnt opex -  Water resources  - OFWAT view","£m","Price Review 2019","","","","","","","","","","","",60.820179781313598]
["WSX","C_TBC_WN_PR19CA004_OFWAT","Total base costs exclude enhancemnt opex -  Water network plus  - OFWAT view","£m","Price Review 2019","","","","","","","","","","","",486.233720482065]
["WSX","C_TBC_WBR_PR19CA008_OFWAT","Total base costs - Bioresources - OFWAT view","£m","Price Review 2019","","","","","","","","","","","",114.690277498344]
["WSX","C_TBC_WWN_PR19CA008_OFWAT","Total base costs - Wastewater network plus - OFWAT view","£m","Price Review 2019","","","","","","","","","","","",884.581685034315]
["WSX","C_UBC_WR_PR19CA004_OFWAT","Unmodelled base costs (Local authority and cumulo rates ) -  Water resources - OFWAT view","£m","Price Review 2019","","","","","","","","","","","",3.2810145914608202]
["WSX","C_UBC_WN_PR19CA004_OFWAT","Unmodelled base costs (Local authority and cumulo rates ) -  Water network plus - OFWAT view","£m","Price Review 2019","","","","","","","","","","","",68.609227970398805]
["WSX","C_UBC_WBR_PR19CA008_OFWAT","Base costs - Unmodelled base costs (Local authority and cumulo rates ) -  Bioresources - OFWAT view","£m","Price Review 2019","","","","","","","","","","","",8.1630133197993793]
["WSX","C_UBC_WWN_PR19CA008_OFWAT","Base costs - Unmodelled base costs (Local authority and cumulo rates ) -  Wastewater network plus - OFWAT view","£m","Price Review 2019","","","","","","","","","","","",34.793493596545602]
["WSX","WS1003_WW4_WR","Unmodelled base costs (Abstraction charges / discharge consent) WR","£m","Price Review 2019","","","","","","","","","","","",11.2225110233599]
["WSX","WS1003_WW4_WN","Unmodelled base costs (Abstraction charges / discharge consent) WN","£m","Price Review 2019","","","","","","","","","","","",1.47616202382081]
["WSX","C_WWN_OUTPERFORM_001","Cost sharing rate for outperform","%","Price Review 2019","","","","","","","","","","","",0.41328584010084202]
["WSX","C_WWN_UNDERPERFORM_001","Cost sharing rate for underperform","%","Price Review 2019","","","","","","","","","","","",0.58671415989915798]
["WSX","B0012WR","Abstraction charges/ discharge consents - Water resources","£m","Cyclical Foundation",2.47946263753408,2.5835450156070401,2.7320000000000002,"","","","","","","","",""]
["WSX","B0012WN","Abstraction charges/ discharge consents - Water Network+","£m","Cyclical Foundation",0.142499230322811,0.14298974377236701,0.152,"","","","","","","","",""]
["WSX","C_WR_CS_EXANTE_001","Ex-ante allowance above Ofwat forecast - Active - Water Resources","£m","Price Review 2019","","","","","","","","","","","",0]
["WSX","C_WN_CS_EXANTE_001","Ex-ante allowance above Ofwat forecast - Active - Water Network","£m","Price Review 2019","","","","","","","","","","","",0]
["WSX","C_WWN_CS_EXANTE_001","Ex-ante allowance above Ofwat forecast - Active - Wastewater Network","£m","Price Review 2019","","","","","","","","","","","",0]
["WSX","C_WR_WN_OUTPERFORM_001","Cost sharing rate for outperform","%","Price Review 2019","","","","","","","","","","","",0.43863536681180498]
["WSX","C_WR_WN_UNDERPERFORM_001","Cost sharing rate for underperform","%","Price Review 2019","","","","","","","","","","","",0.56136463318819496]
["YKY","B0143TAWR","Totex (net of business rates, abstraction licence fees and grants and contributions) - Total actual totex  (net of business rates, abstraction licence fees and grants and contributions) - 12 months ended 31 March 2021 - Water resources","£m","Cyclical Foundation",29.459,40.743000000000002,57.006999999999998,"","","","","","","","",""]
["YKY","B0143TAWNP","Totex (net of business rates, abstraction licence fees and grants and contributions) - Total actual totex  (net of business rates, abstraction licence fees and grants and contributions) - 12 months ended 31 March 2021 - Water network plus","£m","Cyclical Foundation",327.37,333.904,419.029,"","","","","","","","",""]
["YKY","B0143TAWWNP","Totex (net of business rates, abstraction licence fees and grants and contributions) - Total actual totex  (net of business rates, abstraction licence fees and grants and contributions) - 12 months ended 31 March 2021 - Wastewater network plus","£m","Cyclical Foundation",392.15100000000001,384.113,424.88099999999997,"","","","","","","","",""]
["YKY","B0143TATTTH","Totex (net of business rates, abstraction licence fees and grants and contributions) - Total actual totex  (net of business rates, abstraction licence fees and grants and contributions) - 12 months ended 31 March 2021 - Thames Tideway/ Havant Thicket","£m","Cyclical Foundation",0,0,0,"","","","","","","","",""]
["YKY","B0413TGTE_WR","Total green recovery programme expenditure  - Totex - Expenditure in report year - Water resources","£m","Cyclical Foundation","",0,0,"","","","","","","","",""]
["YKY","B0420TGTE_RW","Total green recovery programme expenditure  - Totex - Expenditure in report year - Water network+ Raw water transport","£m","Cyclical Foundation","",0,0,"","","","","","","","",""]
["YKY","B0427TGTE_SW","Total green recovery programme expenditure  - Totex - Expenditure in report year - Water network+ Raw water storage","£m","Cyclical Foundation","",0,0,"","","","","","","","",""]
["YKY","B0434TGTE_TW","Total green recovery programme expenditure  - Totex - Expenditure in report year - Water network+ Water treatment","£m","Cyclical Foundation","",0,0,"","","","","","","","",""]
["YKY","B0441TGTE_DW","Total green recovery programme expenditure  - Totex - Expenditure in report year - Water network+ Treated water distribution","£m","Cyclical Foundation","",0,0,"","","","","","","","",""]
["YKY","B0513TGTE_FOW","Total green recovery programme expenditure  - Totex - Expenditure in report year - Wastewater network+  Foul","£m","Cyclical Foundation","",0,0,"","","","","","","","",""]
["YKY","B0520TGTE_SUW","Total green recovery programme expenditure  - Totex - Expenditure in report year - Wastewater network+  Surface water drainage","£m","Cyclical Foundation","",0,0,"","","","","","","","",""]
["YKY","B0527TGTE_HDW","Total green recovery programme expenditure  - Totex - Expenditure in report year - Wastewater network+  Highway drainage","£m","Cyclical Foundation","",0,0,"","","","","","","","",""]
["YKY","B0534TGTE_STW","Total green recovery programme expenditure  - Totex - Expenditure in report year - Wastewater network+  Sewage treatment and disposal","£m","Cyclical Foundation","",0,0,"","","","","","","","",""]
["YKY","B0541TGTE_SLW","Total green recovery programme expenditure  - Totex - Expenditure in report year - Wastewater network+  Sludge liquor treatment","£m","Cyclical Foundation","",0,0,"","","","","","","","",""]
["YKY","WS01008WR","Operating expenditure - Local authority and Cumulo rates - Water resources","£m","Cyclical Foundation",8.0470000000000006,7.968,7.9210000000000003,"","","","","","","","",""]
["YKY","BM317WN","Local authority and Cumulo rates - Water Network+","£m","Cyclical Foundation",33.353000000000002,33.432000000000002,33.098999999999997,"","","","","","","","",""]
["YKY","BM817WNK","Local authority and Cumulo rates - Wastewater Network+","£m","Cyclical Foundation",16.295000000000002,17.007000000000001,15.382999999999999,"","","","","","","","",""]
["YKY","BM817SG","Local authority and Cumulo rates - Sludge","£m","Cyclical Foundation",1.343,1.4390000000000001,1.288,"","","","","","","","",""]
["YKY","BM817TTT","Local authority rates - TTT","£m","Cyclical Foundation","",0,0,"","","","","","","","",""]
["YKY","C_TBC_WR_PR19CA004_OFWAT","Total base costs exclude enhancemnt opex -  Water resources  - OFWAT view","£m","Price Review 2019","","","","","","","","","","","",178.771737569712]
["YKY","C_TBC_WN_PR19CA004_OFWAT","Total base costs exclude enhancemnt opex -  Water network plus  - OFWAT view","£m","Price Review 2019","","","","","","","","","","","",1374.5382140991701]
["YKY","C_TBC_WBR_PR19CA008_OFWAT","Total base costs - Bioresources - OFWAT view","£m","Price Review 2019","","","","","","","","","","","",268.47196663089898]
["YKY","C_TBC_WWN_PR19CA008_OFWAT","Total base costs - Wastewater network plus - OFWAT view","£m","Price Review 2019","","","","","","","","","","","",1392.89439933016]
["YKY","C_UBC_WR_PR19CA004_OFWAT","Unmodelled base costs (Local authority and cumulo rates ) -  Water resources - OFWAT view","£m","Price Review 2019","","","","","","","","","","","",37.537487137785398]
["YKY","C_UBC_WN_PR19CA004_OFWAT","Unmodelled base costs (Local authority and cumulo rates ) -  Water network plus - OFWAT view","£m","Price Review 2019","","","","","","","","","","","",149.00871477427299]
["YKY","C_UBC_WBR_PR19CA008_OFWAT","Base costs - Unmodelled base costs (Local authority and cumulo rates ) -  Bioresources - OFWAT view","£m","Price Review 2019","","","","","","","","","","","",5.5306781917648902]
["YKY","C_UBC_WWN_PR19CA008_OFWAT","Base costs - Unmodelled base costs (Local authority and cumulo rates ) -  Wastewater network plus - OFWAT view","£m","Price Review 2019","","","","","","","","","","","",80.202936490373801]
["YKY","WS1003_WW4_WR","Unmodelled base costs (Abstraction charges / discharge consent) WR","£m","Price Review 2019","","","","","","","","","","","",25.657891748374102]
["YKY","WS1003_WW4_WN","Unmodelled base costs (Abstraction charges / discharge consent) WN","£m","Price Review 2019","","","","","","","","","","","",0.12170289790713699]
["YKY","C_WWN_OUTPERFORM_001","Cost sharing rate for outperform","%","Price Review 2019","","","","","","","","","","","",0.33205457472928501]
["YKY","C_WWN_UNDERPERFORM_001","Cost sharing rate for underperform","%","Price Review 2019","","","","","","","","","","","",0.66794542527071499]
["YKY","B0012WR","Abstraction charges/ discharge consents - Water resources","£m","Cyclical Foundation",5.56,5.52,10.228999999999999,"","","","","","","","",""]
["YKY","B0012WN","Abstraction charges/ discharge consents - Water Network+","£m","Cyclical Foundation",0.247,0.25,0.251,"","","","","","","","",""]
["YKY","C_WR_CS_EXANTE_001","Ex-ante allowance above Ofwat forecast - Active - Water Resources","£m","Price Review 2019","","","","","","","","","","","",0]
["YKY","C_WN_CS_EXANTE_001","Ex-ante allowance above Ofwat forecast - Active - Water Network","£m","Price Review 2019","","","","","","","","","","","",0]
["YKY","C_WWN_CS_EXANTE_001","Ex-ante allowance above Ofwat forecast - Active - Wastewater Network","£m","Price Review 2019","","","","","","","","","","","",0]
["YKY","C_WR_WN_OUTPERFORM_001","Cost sharing rate for outperform","%","Price Review 2019","","","","","","","","","","","",0.38060224451064895]
["YKY","C_WR_WN_UNDERPERFORM_001","Cost sharing rate for underperform","%","Price Review 2019","","","","","","","","","","","",0.61939775548935105]
["AFW","B0143TAWR","Totex (net of business rates, abstraction licence fees and grants and contributions) - Total actual totex  (net of business rates, abstraction licence fees and grants and contributions) - 12 months ended 31 March 2021 - Water resources","£m","Cyclical Foundation",25.023,18.959,17.591999999999999,"","","","","","","","",""]
["AFW","B0143TAWNP","Totex (net of business rates, abstraction licence fees and grants and contributions) - Total actual totex  (net of business rates, abstraction licence fees and grants and contributions) - 12 months ended 31 March 2021 - Water network plus","£m","Cyclical Foundation",208.30699999999999,264.47300000000001,263.71199999999999,"","","","","","","","",""]
["AFW","B0143TAWWNP","Totex (net of business rates, abstraction licence fees and grants and contributions) - Total actual totex  (net of business rates, abstraction licence fees and grants and contributions) - 12 months ended 31 March 2021 - Wastewater network plus","£m","Cyclical Foundation",0,0,0,"","","","","","","","",""]
["AFW","B0143TATTTH","Totex (net of business rates, abstraction licence fees and grants and contributions) - Total actual totex  (net of business rates, abstraction licence fees and grants and contributions) - 12 months ended 31 March 2021 - Thames Tideway/ Havant Thicket","£m","Cyclical Foundation",0,0,0,"","","","","","","","",""]
["AFW","B0413TGTE_WR","Total green recovery programme expenditure  - Totex - Expenditure in report year - Water resources","£m","Cyclical Foundation","",0,0,"","","","","","","","",""]
["AFW","B0420TGTE_RW","Total green recovery programme expenditure  - Totex - Expenditure in report year - Water network+ Raw water transport","£m","Cyclical Foundation","",0,0,"","","","","","","","",""]
["AFW","B0427TGTE_SW","Total green recovery programme expenditure  - Totex - Expenditure in report year - Water network+ Raw water storage","£m","Cyclical Foundation","",0,0,"","","","","","","","",""]
["AFW","B0434TGTE_TW","Total green recovery programme expenditure  - Totex - Expenditure in report year - Water network+ Water treatment","£m","Cyclical Foundation","",0,0,"","","","","","","","",""]
["AFW","B0441TGTE_DW","Total green recovery programme expenditure  - Totex - Expenditure in report year - Water network+ Treated water distribution","£m","Cyclical Foundation","",0,0,"","","","","","","","",""]
["AFW","B0513TGTE_FOW","Total green recovery programme expenditure  - Totex - Expenditure in report year - Wastewater network+  Foul","£m","Cyclical Foundation","",0,0,"","","","","","","","",""]
["AFW","B0520TGTE_SUW","Total green recovery programme expenditure  - Totex - Expenditure in report year - Wastewater network+  Surface water drainage","£m","Cyclical Foundation","",0,0,"","","","","","","","",""]
["AFW","B0527TGTE_HDW","Total green recovery programme expenditure  - Totex - Expenditure in report year - Wastewater network+  Highway drainage","£m","Cyclical Foundation","",0,0,"","","","","","","","",""]
["AFW","B0534TGTE_STW","Total green recovery programme expenditure  - Totex - Expenditure in report year - Wastewater network+  Sewage treatment and disposal","£m","Cyclical Foundation","",0,0,"","","","","","","","",""]
["AFW","B0541TGTE_SLW","Total green recovery programme expenditure  - Totex - Expenditure in report year - Wastewater network+  Sludge liquor treatment","£m","Cyclical Foundation","",0,0,"","","","","","","","",""]
["AFW","WS01008WR","Operating expenditure - Local authority and Cumulo rates - Water resources","£m","Cyclical Foundation",1.9370000000000001,1.9730000000000001,1.9590000000000001,"","","","","","","","",""]
["AFW","BM317WN","Local authority and Cumulo rates - Water Network+","£m","Cyclical Foundation",13.260999999999999,13.198,13.196,"","","","","","","","",""]
["AFW","BM817WNK","Local authority and Cumulo rates - Wastewater Network+","£m","Cyclical Foundation",0,0,0,"","","","","","","","",""]
["AFW","BM817SG","Local authority and Cumulo rates - Sludge","£m","Cyclical Foundation",0,0,0,"","","","","","","","",""]
["AFW","BM817TTT","Local authority rates - TTT","£m","Cyclical Foundation",0,0,0,"","","","","","","","",""]
["AFW","C_TBC_WR_PR19CA004_OFWAT","Total base costs exclude enhancemnt opex -  Water resources  - OFWAT view","£m","Price Review 2019","","","","","","","","","","","",88.081653639125307]
["AFW","C_TBC_WN_PR19CA004_OFWAT","Total base costs exclude enhancemnt opex -  Water network plus  - OFWAT view","£m","Price Review 2019","","","","","","","","","","","",1002.9567531872]
["AFW","C_TBC_WBR_PR19CA008_OFWAT","Total base costs - Bioresources - OFWAT view","£m","Price Review 2019","","","","","","","","","","","",""]
["AFW","C_TBC_WWN_PR19CA008_OFWAT","Total base costs - Wastewater network plus - OFWAT view","£m","Price Review 2019","","","","","","","","","","","",""]
["AFW","C_UBC_WR_PR19CA004_OFWAT","Unmodelled base costs (Local authority and cumulo rates ) -  Water resources - OFWAT view","£m","Price Review 2019","","","","","","","","","","","",8.8140848088263493]
["AFW","C_UBC_WN_PR19CA004_OFWAT","Unmodelled base costs (Local authority and cumulo rates ) -  Water network plus - OFWAT view","£m","Price Review 2019","","","","","","","","","","","",60.994171299440602]
["AFW","C_UBC_WBR_PR19CA008_OFWAT","Base costs - Unmodelled base costs (Local authority and cumulo rates ) -  Bioresources - OFWAT view","£m","Price Review 2019","","","","","","","","","","","",""]
["AFW","C_UBC_WWN_PR19CA008_OFWAT","Base costs - Unmodelled base costs (Local authority and cumulo rates ) -  Wastewater network plus - OFWAT view","£m","Price Review 2019","","","","","","","","","","","",""]
["AFW","WS1003_WW4_WR","Unmodelled base costs (Abstraction charges / discharge consent) WR","£m","Price Review 2019","","","","","","","","","","","",21.4203037322116]
["AFW","WS1003_WW4_WN","Unmodelled base costs (Abstraction charges / discharge consent) WN","£m","Price Review 2019","","","","","","","","","","","",0]
["AFW","C_WWN_OUTPERFORM_001","Cost sharing rate for outperform","%","Price Review 2019","","","","","","","","","","","",0.65]
["AFW","C_WWN_UNDERPERFORM_001","Cost sharing rate for underperform","%","Price Review 2019","","","","","","","","","","","",0.5]
["AFW","B0012WR","Abstraction charges/ discharge consents - Water resources","£m","Cyclical Foundation",3.8250000000000002,4.0410000000000004,6.1890000000000001,"","","","","","","","",""]
["AFW","B0012WN","Abstraction charges/ discharge consents - Water Network+","£m","Cyclical Foundation",0,0,0,"","","","","","","","",""]
["AFW","C_WR_CS_EXANTE_001","Ex-ante allowance above Ofwat forecast - Active - Water Resources","£m","Price Review 2019","","","","","","","","","","","",0]
["AFW","C_WN_CS_EXANTE_001","Ex-ante allowance above Ofwat forecast - Active - Water Network","£m","Price Review 2019","","","","","","","","","","","",0]
["AFW","C_WWN_CS_EXANTE_001","Ex-ante allowance above Ofwat forecast - Active - Wastewater Network","£m","Price Review 2019","","","","","","","","","","","",0]
["AFW","C_WR_WN_OUTPERFORM_001","Cost sharing rate for outperform","%","Price Review 2019","","","","","","","","","","","",0.46514359629283097]
["AFW","C_WR_WN_UNDERPERFORM_001","Cost sharing rate for underperform","%","Price Review 2019","","","","","","","","","","","",0.53485640370716903]
["BRL","B0143TAWR","Totex (net of business rates, abstraction licence fees and grants and contributions) - Total actual totex  (net of business rates, abstraction licence fees and grants and contributions) - 12 months ended 31 March 2021 - Water resources","£m","Cyclical Foundation",9.7840000000000007,9.9649999999999999,12.044,"","","","","","","","",""]
["BRL","B0143TAWNP","Totex (net of business rates, abstraction licence fees and grants and contributions) - Total actual totex  (net of business rates, abstraction licence fees and grants and contributions) - 12 months ended 31 March 2021 - Water network plus","£m","Cyclical Foundation",71.951999999999998,70.524000000000001,88.192999999999998,"","","","","","","","",""]
["BRL","B0143TAWWNP","Totex (net of business rates, abstraction licence fees and grants and contributions) - Total actual totex  (net of business rates, abstraction licence fees and grants and contributions) - 12 months ended 31 March 2021 - Wastewater network plus","£m","Cyclical Foundation",0,0,0,"","","","","","","","",""]
["BRL","B0143TATTTH","Totex (net of business rates, abstraction licence fees and grants and contributions) - Total actual totex  (net of business rates, abstraction licence fees and grants and contributions) - 12 months ended 31 March 2021 - Thames Tideway/ Havant Thicket","£m","Cyclical Foundation",0,0,0,"","","","","","","","",""]
["BRL","B0413TGTE_WR","Total green recovery programme expenditure  - Totex - Expenditure in report year - Water resources","£m","Cyclical Foundation","",0,0,"","","","","","","","",""]
["BRL","B0420TGTE_RW","Total green recovery programme expenditure  - Totex - Expenditure in report year - Water network+ Raw water transport","£m","Cyclical Foundation","",0,0,"","","","","","","","",""]
["BRL","B0427TGTE_SW","Total green recovery programme expenditure  - Totex - Expenditure in report year - Water network+ Raw water storage","£m","Cyclical Foundation","",0,0,"","","","","","","","",""]
["BRL","B0434TGTE_TW","Total green recovery programme expenditure  - Totex - Expenditure in report year - Water network+ Water treatment","£m","Cyclical Foundation","",0,0,"","","","","","","","",""]
["BRL","B0441TGTE_DW","Total green recovery programme expenditure  - Totex - Expenditure in report year - Water network+ Treated water distribution","£m","Cyclical Foundation","",0,0,"","","","","","","","",""]
["BRL","B0513TGTE_FOW","Total green recovery programme expenditure  - Totex - Expenditure in report year - Wastewater network+  Foul","£m","Cyclical Foundation","",0,0,"","","","","","","","",""]
["BRL","B0520TGTE_SUW","Total green recovery programme expenditure  - Totex - Expenditure in report year - Wastewater network+  Surface water drainage","£m","Cyclical Foundation","",0,0,"","","","","","","","",""]
["BRL","B0527TGTE_HDW","Total green recovery programme expenditure  - Totex - Expenditure in report year - Wastewater network+  Highway drainage","£m","Cyclical Foundation","",0,0,"","","","","","","","",""]
["BRL","B0534TGTE_STW","Total green recovery programme expenditure  - Totex - Expenditure in report year - Wastewater network+  Sewage treatment and disposal","£m","Cyclical Foundation","",0,0,"","","","","","","","",""]
["BRL","B0541TGTE_SLW","Total green recovery programme expenditure  - Totex - Expenditure in report year - Wastewater network+  Sludge liquor treatment","£m","Cyclical Foundation","",0,0,"","","","","","","","",""]
["BRL","WS01008WR","Operating expenditure - Local authority and Cumulo rates - Water resources","£m","Cyclical Foundation",1.304,1.3049999999999999,1.3069999999999999,"","","","","","","","",""]
["BRL","BM317WN","Local authority and Cumulo rates - Water Network+","£m","Cyclical Foundation",3.7839999999999998,3.786,3.7850000000000001,"","","","","","","","",""]
["BRL","BM817WNK","Local authority and Cumulo rates - Wastewater Network+","£m","Cyclical Foundation",0,0,0,"","","","","","","","",""]
["BRL","BM817SG","Local authority and Cumulo rates - Sludge","£m","Cyclical Foundation",0,0,0,"","","","","","","","",""]
["BRL","BM817TTT","Local authority rates - TTT","£m","Cyclical Foundation",0,0,0,"","","","","","","","",""]
["BRL","C_TBC_WR_PR19CA004_OFWAT","Total base costs exclude enhancemnt opex -  Water resources  - OFWAT view","£m","Price Review 2019","","","","","","","","","","","",69.364462291278699]
["BRL","C_TBC_WN_PR19CA004_OFWAT","Total base costs exclude enhancemnt opex -  Water network plus  - OFWAT view","£m","Price Review 2019","","","","","","","","","","","",312.00620991129102]
["BRL","C_TBC_WBR_PR19CA008_OFWAT","Total base costs - Bioresources - OFWAT view","£m","Price Review 2019","","","","","","","","","","","",""]
["BRL","C_TBC_WWN_PR19CA008_OFWAT","Total base costs - Wastewater network plus - OFWAT view","£m","Price Review 2019","","","","","","","","","","","",""]
["BRL","C_UBC_WR_PR19CA004_OFWAT","Unmodelled base costs (Local authority and cumulo rates ) -  Water resources - OFWAT view","£m","Price Review 2019","","","","","","","","","","","",6.1696230925936701]
["BRL","C_UBC_WN_PR19CA004_OFWAT","Unmodelled base costs (Local authority and cumulo rates ) -  Water network plus - OFWAT view","£m","Price Review 2019","","","","","","","","","","","",16.840850913258802]
["BRL","C_UBC_WBR_PR19CA008_OFWAT","Base costs - Unmodelled base costs (Local authority and cumulo rates ) -  Bioresources - OFWAT view","£m","Price Review 2019","","","","","","","","","","","",""]
["BRL","C_UBC_WWN_PR19CA008_OFWAT","Base costs - Unmodelled base costs (Local authority and cumulo rates ) -  Wastewater network plus - OFWAT view","£m","Price Review 2019","","","","","","","","","","","",""]
["BRL","WS1003_WW4_WR","Unmodelled base costs (Abstraction charges / discharge consent) WR","£m","Price Review 2019","","","","","","","","","","","",14.1292196354269]
["BRL","WS1003_WW4_WN","Unmodelled base costs (Abstraction charges / discharge consent) WN","£m","Price Review 2019","","","","","","","","","","","",0.50433680892717303]
["BRL","C_WWN_OUTPERFORM_001","Cost sharing rate for outperform","%","Price Review 2019","","","","","","","","","","","",0.65]
["BRL","C_WWN_UNDERPERFORM_001","Cost sharing rate for underperform","%","Price Review 2019","","","","","","","","","","","",0.5]
["BRL","B0012WR","Abstraction charges/ discharge consents - Water resources","£m","Cyclical Foundation",2.7280000000000002,2.7290000000000001,2.2080000000000002,"","","","","","","","",""]
["BRL","B0012WN","Abstraction charges/ discharge consents - Water Network+","£m","Cyclical Foundation",0.106,0.10299999999999999,0.10299999999999999,"","","","","","","","",""]
["BRL","C_WR_CS_EXANTE_001","Ex-ante allowance above Ofwat forecast - Active - Water Resources","£m","Price Review 2019","","","","","","","","","","","",0]
["BRL","C_WN_CS_EXANTE_001","Ex-ante allowance above Ofwat forecast - Active - Water Network","£m","Price Review 2019","","","","","","","","","","","",0]
["BRL","C_WWN_CS_EXANTE_001","Ex-ante allowance above Ofwat forecast - Active - Wastewater Network","£m","Price Review 2019","","","","","","","","","","","",0]
["BRL","C_WR_WN_OUTPERFORM_001","Cost sharing rate for outperform","%","Price Review 2019","","","","","","","","","","","",0.39760021523090999]
["BRL","C_WR_WN_UNDERPERFORM_001","Cost sharing rate for underperform","%","Price Review 2019","","","","","","","","","","","",0.60239978476908995]
["PRT","B0143TAWR","Totex (net of business rates, abstraction licence fees and grants and contributions) - Total actual totex  (net of business rates, abstraction licence fees and grants and contributions) - 12 months ended 31 March 2021 - Water resources","£m","Cyclical Foundation",4.0670000000000002,4.1050000000000004,4.5110000000000001,"","","","","","","","",""]
["PRT","B0143TAWNP","Totex (net of business rates, abstraction licence fees and grants and contributions) - Total actual totex  (net of business rates, abstraction licence fees and grants and contributions) - 12 months ended 31 March 2021 - Water network plus","£m","Cyclical Foundation",25.594999999999999,23.928999999999998,29.26,"","","","","","","","",""]
["PRT","B0143TAWWNP","Totex (net of business rates, abstraction licence fees and grants and contributions) - Total actual totex  (net of business rates, abstraction licence fees and grants and contributions) - 12 months ended 31 March 2021 - Wastewater network plus","£m","Cyclical Foundation",0,0,0,"","","","","","","","",""]
["PRT","B0143TATTTH","Totex (net of business rates, abstraction licence fees and grants and contributions) - Total actual totex  (net of business rates, abstraction licence fees and grants and contributions) - 12 months ended 31 March 2021 - Thames Tideway/ Havant Thicket","£m","Cyclical Foundation",11.831,5.8079999999999998,27.061,"","","","","","","","",""]
["PRT","B0413TGTE_WR","Total green recovery programme expenditure  - Totex - Expenditure in report year - Water resources","£m","Cyclical Foundation","",0,0,"","","","","","","","",""]
["PRT","B0420TGTE_RW","Total green recovery programme expenditure  - Totex - Expenditure in report year - Water network+ Raw water transport","£m","Cyclical Foundation","",0,0,"","","","","","","","",""]
["PRT","B0427TGTE_SW","Total green recovery programme expenditure  - Totex - Expenditure in report year - Water network+ Raw water storage","£m","Cyclical Foundation","",0,0,"","","","","","","","",""]
["PRT","B0434TGTE_TW","Total green recovery programme expenditure  - Totex - Expenditure in report year - Water network+ Water treatment","£m","Cyclical Foundation","",0,0,"","","","","","","","",""]
["PRT","B0441TGTE_DW","Total green recovery programme expenditure  - Totex - Expenditure in report year - Water network+ Treated water distribution","£m","Cyclical Foundation","",0,0,"","","","","","","","",""]
["PRT","B0513TGTE_FOW","Total green recovery programme expenditure  - Totex - Expenditure in report year - Wastewater network+  Foul","£m","Cyclical Foundation","",0,0,"","","","","","","","",""]
["PRT","B0520TGTE_SUW","Total green recovery programme expenditure  - Totex - Expenditure in report year - Wastewater network+  Surface water drainage","£m","Cyclical Foundation","",0,0,"","","","","","","","",""]
["PRT","B0527TGTE_HDW","Total green recovery programme expenditure  - Totex - Expenditure in report year - Wastewater network+  Highway drainage","£m","Cyclical Foundation","",0,0,"","","","","","","","",""]
["PRT","B0534TGTE_STW","Total green recovery programme expenditure  - Totex - Expenditure in report year - Wastewater network+  Sewage treatment and disposal","£m","Cyclical Foundation","",0,0,"","","","","","","","",""]
["PRT","B0541TGTE_SLW","Total green recovery programme expenditure  - Totex - Expenditure in report year - Wastewater network+  Sludge liquor treatment","£m","Cyclical Foundation","",0,0,"","","","","","","","",""]
["PRT","WS01008WR","Operating expenditure - Local authority and Cumulo rates - Water resources","£m","Cyclical Foundation",0.48099999999999998,0.48099999999999998,0.48099999999999998,"","","","","","","","",""]
["PRT","BM317WN","Local authority and Cumulo rates - Water Network+","£m","Cyclical Foundation",1.754,1.754,1.754,"","","","","","","","",""]
["PRT","BM817WNK","Local authority and Cumulo rates - Wastewater Network+","£m","Cyclical Foundation",0,0,0,"","","","","","","","",""]
["PRT","BM817SG","Local authority and Cumulo rates - Sludge","£m","Cyclical Foundation",0,0,0,"","","","","","","","",""]
["PRT","BM817TTT","Local authority rates - TTT","£m","Cyclical Foundation",0,0,0,"","","","","","","","",""]
["PRT","C_TBC_WR_PR19CA004_OFWAT","Total base costs exclude enhancemnt opex -  Water resources  - OFWAT view","£m","Price Review 2019","","","","","","","","","","","",25.529957694013898]
["PRT","C_TBC_WN_PR19CA004_OFWAT","Total base costs exclude enhancemnt opex -  Water network plus  - OFWAT view","£m","Price Review 2019","","","","","","","","","","","",138.03129606412799]
["PRT","C_TBC_WBR_PR19CA008_OFWAT","Total base costs - Bioresources - OFWAT view","£m","Price Review 2019","","","","","","","","","","","",""]
["PRT","C_TBC_WWN_PR19CA008_OFWAT","Total base costs - Wastewater network plus - OFWAT view","£m","Price Review 2019","","","","","","","","","","","",""]
["PRT","C_UBC_WR_PR19CA004_OFWAT","Unmodelled base costs (Local authority and cumulo rates ) -  Water resources - OFWAT view","£m","Price Review 2019","","","","","","","","","","","",2.20267154583766]
["PRT","C_UBC_WN_PR19CA004_OFWAT","Unmodelled base costs (Local authority and cumulo rates ) -  Water network plus - OFWAT view","£m","Price Review 2019","","","","","","","","","","","",8.0301081101943605]
["PRT","C_UBC_WBR_PR19CA008_OFWAT","Base costs - Unmodelled base costs (Local authority and cumulo rates ) -  Bioresources - OFWAT view","£m","Price Review 2019","","","","","","","","","","","",""]
["PRT","C_UBC_WWN_PR19CA008_OFWAT","Base costs - Unmodelled base costs (Local authority and cumulo rates ) -  Wastewater network plus - OFWAT view","£m","Price Review 2019","","","","","","","","","","","",""]
["PRT","WS1003_WW4_WR","Unmodelled base costs (Abstraction charges / discharge consent) WR","£m","Price Review 2019","","","","","","","","","","","",6.1844544600490403]
["PRT","WS1003_WW4_WN","Unmodelled base costs (Abstraction charges / discharge consent) WN","£m","Price Review 2019","","","","","","","","","","","",0]
["PRT","C_WWN_OUTPERFORM_001","Cost sharing rate for outperform","%","Price Review 2019","","","","","","","","","","","",0.65]
["PRT","C_WWN_UNDERPERFORM_001","Cost sharing rate for underperform","%","Price Review 2019","","","","","","","","","","","",0.5]
["PRT","B0012WR","Abstraction charges/ discharge consents - Water resources","£m","Cyclical Foundation",1.3220000000000001,1.3220000000000001,1.5069999999999999,"","","","","","","","",""]
["PRT","B0012WN","Abstraction charges/ discharge consents - Water Network+","£m","Cyclical Foundation",0,0,0,"","","","","","","","",""]
["PRT","C_WR_CS_EXANTE_001","Ex-ante allowance above Ofwat forecast - Active - Water Resources","£m","Price Review 2019","","","","","","","","","","","",-1.0656296184459999]
["PRT","C_WN_CS_EXANTE_001","Ex-ante allowance above Ofwat forecast - Active - Water Network","£m","Price Review 2019","","","","","","","","","","","",-6.3355875960341201]
["PRT","C_WWN_CS_EXANTE_001","Ex-ante allowance above Ofwat forecast - Active - Wastewater Network","£m","Price Review 2019","","","","","","","","","","","",0]
["PRT","C_WR_WN_OUTPERFORM_001","Cost sharing rate for outperform","%","Price Review 2019","","","","","","","","","","","",0.60082748797392904]
["PRT","C_WR_WN_UNDERPERFORM_001","Cost sharing rate for underperform","%","Price Review 2019","","","","","","","","","","","",0.5]
["SEW","B0143TAWR","Totex (net of business rates, abstraction licence fees and grants and contributions) - Total actual totex  (net of business rates, abstraction licence fees and grants and contributions) - 12 months ended 31 March 2021 - Water resources","£m","Cyclical Foundation",17.220336443000001,18.341000000000001,22.344480074500002,"","","","","","","","",""]
["SEW","B0143TAWNP","Totex (net of business rates, abstraction licence fees and grants and contributions) - Total actual totex  (net of business rates, abstraction licence fees and grants and contributions) - 12 months ended 31 March 2021 - Water network plus","£m","Cyclical Foundation",145.68035771020001,134.185,171.0562060403,"","","","","","","","",""]
["SEW","B0143TAWWNP","Totex (net of business rates, abstraction licence fees and grants and contributions) - Total actual totex  (net of business rates, abstraction licence fees and grants and contributions) - 12 months ended 31 March 2021 - Wastewater network plus","£m","Cyclical Foundation",0,0,0,"","","","","","","","",""]
["SEW","B0143TATTTH","Totex (net of business rates, abstraction licence fees and grants and contributions) - Total actual totex  (net of business rates, abstraction licence fees and grants and contributions) - 12 months ended 31 March 2021 - Thames Tideway/ Havant Thicket","£m","Cyclical Foundation",0,0,0,"","","","","","","","",""]
["SEW","B0413TGTE_WR","Total green recovery programme expenditure  - Totex - Expenditure in report year - Water resources","£m","Cyclical Foundation","",0,0,"","","","","","","","",""]
["SEW","B0420TGTE_RW","Total green recovery programme expenditure  - Totex - Expenditure in report year - Water network+ Raw water transport","£m","Cyclical Foundation","",0,0,"","","","","","","","",""]
["SEW","B0427TGTE_SW","Total green recovery programme expenditure  - Totex - Expenditure in report year - Water network+ Raw water storage","£m","Cyclical Foundation","",0,0,"","","","","","","","",""]
["SEW","B0434TGTE_TW","Total green recovery programme expenditure  - Totex - Expenditure in report year - Water network+ Water treatment","£m","Cyclical Foundation","",0,0,"","","","","","","","",""]
["SEW","B0441TGTE_DW","Total green recovery programme expenditure  - Totex - Expenditure in report year - Water network+ Treated water distribution","£m","Cyclical Foundation","",0,0,"","","","","","","","",""]
["SEW","B0513TGTE_FOW","Total green recovery programme expenditure  - Totex - Expenditure in report year - Wastewater network+  Foul","£m","Cyclical Foundation","",0,0,"","","","","","","","",""]
["SEW","B0520TGTE_SUW","Total green recovery programme expenditure  - Totex - Expenditure in report year - Wastewater network+  Surface water drainage","£m","Cyclical Foundation","",0,0,"","","","","","","","",""]
["SEW","B0527TGTE_HDW","Total green recovery programme expenditure  - Totex - Expenditure in report year - Wastewater network+  Highway drainage","£m","Cyclical Foundation","",0,0,"","","","","","","","",""]
["SEW","B0534TGTE_STW","Total green recovery programme expenditure  - Totex - Expenditure in report year - Wastewater network+  Sewage treatment and disposal","£m","Cyclical Foundation","",0,0,"","","","","","","","",""]
["SEW","B0541TGTE_SLW","Total green recovery programme expenditure  - Totex - Expenditure in report year - Wastewater network+  Sludge liquor treatment","£m","Cyclical Foundation","",0,0,"","","","","","","","",""]
["SEW","WS01008WR","Operating expenditure - Local authority and Cumulo rates - Water resources","£m","Cyclical Foundation",0.95199999999999996,0.95299999999999996,0.95299999999999996,"","","","","","","","",""]
["SEW","BM317WN","Local authority and Cumulo rates - Water Network+","£m","Cyclical Foundation",17.108000000000001,17.119,17.119,"","","","","","","","",""]
["SEW","BM817WNK","Local authority and Cumulo rates - Wastewater Network+","£m","Cyclical Foundation",0,0,0,"","","","","","","","",""]
["SEW","BM817SG","Local authority and Cumulo rates - Sludge","£m","Cyclical Foundation",0,0,0,"","","","","","","","",""]
["SEW","BM817TTT","Local authority rates - TTT","£m","Cyclical Foundation",0,0,0,"","","","","","","","",""]
["SEW","C_TBC_WR_PR19CA004_OFWAT","Total base costs exclude enhancemnt opex -  Water resources  - OFWAT view","£m","Price Review 2019","","","","","","","","","","","",74.963597718697102]
["SEW","C_TBC_WN_PR19CA004_OFWAT","Total base costs exclude enhancemnt opex -  Water network plus  - OFWAT view","£m","Price Review 2019","","","","","","","","","","","",661.24349002987503]
["SEW","C_TBC_WBR_PR19CA008_OFWAT","Total base costs - Bioresources - OFWAT view","£m","Price Review 2019","","","","","","","","","","","",""]
["SEW","C_TBC_WWN_PR19CA008_OFWAT","Total base costs - Wastewater network plus - OFWAT view","£m","Price Review 2019","","","","","","","","","","","",""]
["SEW","C_UBC_WR_PR19CA004_OFWAT","Unmodelled base costs (Local authority and cumulo rates ) -  Water resources - OFWAT view","£m","Price Review 2019","","","","","","","","","","","",4.4311206029116104]
["SEW","C_UBC_WN_PR19CA004_OFWAT","Unmodelled base costs (Local authority and cumulo rates ) -  Water network plus - OFWAT view","£m","Price Review 2019","","","","","","","","","","","",77.182842733614095]
["SEW","C_UBC_WBR_PR19CA008_OFWAT","Base costs - Unmodelled base costs (Local authority and cumulo rates ) -  Bioresources - OFWAT view","£m","Price Review 2019","","","","","","","","","","","",""]
["SEW","C_UBC_WWN_PR19CA008_OFWAT","Base costs - Unmodelled base costs (Local authority and cumulo rates ) -  Wastewater network plus - OFWAT view","£m","Price Review 2019","","","","","","","","","","","",""]
["SEW","WS1003_WW4_WR","Unmodelled base costs (Abstraction charges / discharge consent) WR","£m","Price Review 2019","","","","","","","","","","","",13.9841497811216]
["SEW","WS1003_WW4_WN","Unmodelled base costs (Abstraction charges / discharge consent) WN","£m","Price Review 2019","","","","","","","","","","","",0.68153622827996396]
["SEW","C_WWN_OUTPERFORM_001","Cost sharing rate for outperform","%","Price Review 2019","","","","","","","","","","","",0.65]
["SEW","C_WWN_UNDERPERFORM_001","Cost sharing rate for underperform","%","Price Review 2019","","","","","","","","","","","",0.5]
["SEW","B0012WR","Abstraction charges/ discharge consents - Water resources","£m","Cyclical Foundation",2.9340000000000002,2.996,4.03,"","","","","","","","",""]
["SEW","B0012WN","Abstraction charges/ discharge consents - Water Network+","£m","Cyclical Foundation",0.17199999999999999,0.14399999999999999,0.25700000000000001,"","","","","","","","",""]
["SEW","C_WR_CS_EXANTE_001","Ex-ante allowance above Ofwat forecast - Active - Water Resources","£m","Price Review 2019","","","","","","","","","","","",0]
["SEW","C_WN_CS_EXANTE_001","Ex-ante allowance above Ofwat forecast - Active - Water Network","£m","Price Review 2019","","","","","","","","","","","",0]
["SEW","C_WWN_CS_EXANTE_001","Ex-ante allowance above Ofwat forecast - Active - Wastewater Network","£m","Price Review 2019","","","","","","","","","","","",0]
["SEW","C_WR_WN_OUTPERFORM_001","Cost sharing rate for outperform","%","Price Review 2019","","","","","","","","","","","",0.38088968486658298]
["SEW","C_WR_WN_UNDERPERFORM_001","Cost sharing rate for underperform","%","Price Review 2019","","","","","","","","","","","",0.61911031513341697]
["SSC","B0143TAWR","Totex (net of business rates, abstraction licence fees and grants and contributions) - Total actual totex  (net of business rates, abstraction licence fees and grants and contributions) - 12 months ended 31 March 2021 - Water resources","£m","Cyclical Foundation",7.4589999999999996,8.0969999999999995,8.48922893952283,"","","","","","","","",""]
["SSC","B0143TAWNP","Totex (net of business rates, abstraction licence fees and grants and contributions) - Total actual totex  (net of business rates, abstraction licence fees and grants and contributions) - 12 months ended 31 March 2021 - Water network plus","£m","Cyclical Foundation",81.384,89.144999999999996,120.42988730794799,"","","","","","","","",""]
["SSC","B0143TAWWNP","Totex (net of business rates, abstraction licence fees and grants and contributions) - Total actual totex  (net of business rates, abstraction licence fees and grants and contributions) - 12 months ended 31 March 2021 - Wastewater network plus","£m","Cyclical Foundation",0,0,0,"","","","","","","","",""]
["SSC","B0143TATTTH","Totex (net of business rates, abstraction licence fees and grants and contributions) - Total actual totex  (net of business rates, abstraction licence fees and grants and contributions) - 12 months ended 31 March 2021 - Thames Tideway/ Havant Thicket","£m","Cyclical Foundation",0,0,0,"","","","","","","","",""]
["SSC","B0413TGTE_WR","Total green recovery programme expenditure  - Totex - Expenditure in report year - Water resources","£m","Cyclical Foundation","",0,0,"","","","","","","","",""]
["SSC","B0420TGTE_RW","Total green recovery programme expenditure  - Totex - Expenditure in report year - Water network+ Raw water transport","£m","Cyclical Foundation","",0,0,"","","","","","","","",""]
["SSC","B0427TGTE_SW","Total green recovery programme expenditure  - Totex - Expenditure in report year - Water network+ Raw water storage","£m","Cyclical Foundation","",0,0,"","","","","","","","",""]
["SSC","B0434TGTE_TW","Total green recovery programme expenditure  - Totex - Expenditure in report year - Water network+ Water treatment","£m","Cyclical Foundation","",1.14752350043155,5.0384295105294399,"","","","","","","","",""]
["SSC","B0441TGTE_DW","Total green recovery programme expenditure  - Totex - Expenditure in report year - Water network+ Treated water distribution","£m","Cyclical Foundation","",0,0,"","","","","","","","",""]
["SSC","B0513TGTE_FOW","Total green recovery programme expenditure  - Totex - Expenditure in report year - Wastewater network+  Foul","£m","Cyclical Foundation","",0,0,"","","","","","","","",""]
["SSC","B0520TGTE_SUW","Total green recovery programme expenditure  - Totex - Expenditure in report year - Wastewater network+  Surface water drainage","£m","Cyclical Foundation","",0,0,"","","","","","","","",""]
["SSC","B0527TGTE_HDW","Total green recovery programme expenditure  - Totex - Expenditure in report year - Wastewater network+  Highway drainage","£m","Cyclical Foundation","",0,0,"","","","","","","","",""]
["SSC","B0534TGTE_STW","Total green recovery programme expenditure  - Totex - Expenditure in report year - Wastewater network+  Sewage treatment and disposal","£m","Cyclical Foundation","",0,0,"","","","","","","","",""]
["SSC","B0541TGTE_SLW","Total green recovery programme expenditure  - Totex - Expenditure in report year - Wastewater network+  Sludge liquor treatment","£m","Cyclical Foundation","",0,0,"","","","","","","","",""]
["SSC","WS01008WR","Operating expenditure - Local authority and Cumulo rates - Water resources","£m","Cyclical Foundation",0.156,0.215,0.20799999999999999,"","","","","","","","",""]
["SSC","BM317WN","Local authority and Cumulo rates - Water Network+","£m","Cyclical Foundation",4.9029999999999996,4.8929999999999998,4.931,"","","","","","","","",""]
["SSC","BM817WNK","Local authority and Cumulo rates - Wastewater Network+","£m","Cyclical Foundation",0,0,0,"","","","","","","","",""]
["SSC","BM817SG","Local authority and Cumulo rates - Sludge","£m","Cyclical Foundation",0,0,0,"","","","","","","","",""]
["SSC","BM817TTT","Local authority rates - TTT","£m","Cyclical Foundation",0,0,0,"","","","","","","","",""]
["SSC","C_TBC_WR_PR19CA004_OFWAT","Total base costs exclude enhancemnt opex -  Water resources  - OFWAT view","£m","Price Review 2019","","","","","","","","","","","",41.684606920384603]
["SSC","C_TBC_WN_PR19CA004_OFWAT","Total base costs exclude enhancemnt opex -  Water network plus  - OFWAT view","£m","Price Review 2019","","","","","","","","","","","",400.10972363530101]
["SSC","C_TBC_WBR_PR19CA008_OFWAT","Total base costs - Bioresources - OFWAT view","£m","Price Review 2019","","","","","","","","","","","",""]
["SSC","C_TBC_WWN_PR19CA008_OFWAT","Total base costs - Wastewater network plus - OFWAT view","£m","Price Review 2019","","","","","","","","","","","",""]
["SSC","C_UBC_WR_PR19CA004_OFWAT","Unmodelled base costs (Local authority and cumulo rates ) -  Water resources - OFWAT view","£m","Price Review 2019","","","","","","","","","","","",0.73234999090897102]
["SSC","C_UBC_WN_PR19CA004_OFWAT","Unmodelled base costs (Local authority and cumulo rates ) -  Water network plus - OFWAT view","£m","Price Review 2019","","","","","","","","","","","",24.040591719874801]
["SSC","C_UBC_WBR_PR19CA008_OFWAT","Base costs - Unmodelled base costs (Local authority and cumulo rates ) -  Bioresources - OFWAT view","£m","Price Review 2019","","","","","","","","","","","",""]
["SSC","C_UBC_WWN_PR19CA008_OFWAT","Base costs - Unmodelled base costs (Local authority and cumulo rates ) -  Wastewater network plus - OFWAT view","£m","Price Review 2019","","","","","","","","","","","",""]
["SSC","WS1003_WW4_WR","Unmodelled base costs (Abstraction charges / discharge consent) WR","£m","Price Review 2019","","","","","","","","","","","",15.2244410830159]
["SSC","WS1003_WW4_WN","Unmodelled base costs (Abstraction charges / discharge consent) WN","£m","Price Review 2019","","","","","","","","","","","",0.510347600660498]
["SSC","C_WWN_OUTPERFORM_001","Cost sharing rate for outperform","%","Price Review 2019","","","","","","","","","","","",0.65]
["SSC","C_WWN_UNDERPERFORM_001","Cost sharing rate for underperform","%","Price Review 2019","","","","","","","","","","","",0.5]
["SSC","B0012WR","Abstraction charges/ discharge consents - Water resources","£m","Cyclical Foundation",3.036,3.1019999999999999,3.5920000000000001,"","","","","","","","",""]
["SSC","B0012WN","Abstraction charges/ discharge consents - Water Network+","£m","Cyclical Foundation",0.217,0.11700000000000001,0.32200000000000001,"","","","","","","","",""]
["SSC","C_WR_CS_EXANTE_001","Ex-ante allowance above Ofwat forecast - Active - Water Resources","£m","Price Review 2019","","","","","","","","","","","",0]
["SSC","C_WN_CS_EXANTE_001","Ex-ante allowance above Ofwat forecast - Active - Water Network","£m","Price Review 2019","","","","","","","","","","","",0]
["SSC","C_WWN_CS_EXANTE_001","Ex-ante allowance above Ofwat forecast - Active - Wastewater Network","£m","Price Review 2019","","","","","","","","","","","",0]
["SSC","C_WR_WN_OUTPERFORM_001","Cost sharing rate for outperform","%","Price Review 2019","","","","","","","","","","","",0.45061484255787598]
["SSC","C_WR_WN_UNDERPERFORM_001","Cost sharing rate for underperform","%","Price Review 2019","","","","","","","","","","","",0.54938515744212402]
["SES","B0143TAWR","Totex (net of business rates, abstraction licence fees and grants and contributions) - Total actual totex  (net of business rates, abstraction licence fees and grants and contributions) - 12 months ended 31 March 2021 - Water resources","£m","Cyclical Foundation",5.589517176977,4.1792629856893297,5.3128285259901196,"","","","","","","","",""]
["SES","B0143TAWNP","Totex (net of business rates, abstraction licence fees and grants and contributions) - Total actual totex  (net of business rates, abstraction licence fees and grants and contributions) - 12 months ended 31 March 2021 - Water network plus","£m","Cyclical Foundation",47.175823516256202,48.673513835720797,53.726648383839297,"","","","","","","","",""]
["SES","B0143TAWWNP","Totex (net of business rates, abstraction licence fees and grants and contributions) - Total actual totex  (net of business rates, abstraction licence fees and grants and contributions) - 12 months ended 31 March 2021 - Wastewater network plus","£m","Cyclical Foundation",0,0,0,"","","","","","","","",""]
["SES","B0143TATTTH","Totex (net of business rates, abstraction licence fees and grants and contributions) - Total actual totex  (net of business rates, abstraction licence fees and grants and contributions) - 12 months ended 31 March 2021 - Thames Tideway/ Havant Thicket","£m","Cyclical Foundation",0,0,0,"","","","","","","","",""]
["SES","B0413TGTE_WR","Total green recovery programme expenditure  - Totex - Expenditure in report year - Water resources","£m","Cyclical Foundation","",0,0,"","","","","","","","",""]
["SES","B0420TGTE_RW","Total green recovery programme expenditure  - Totex - Expenditure in report year - Water network+ Raw water transport","£m","Cyclical Foundation","",0,0,"","","","","","","","",""]
["SES","B0427TGTE_SW","Total green recovery programme expenditure  - Totex - Expenditure in report year - Water network+ Raw water storage","£m","Cyclical Foundation","",0,0,"","","","","","","","",""]
["SES","B0434TGTE_TW","Total green recovery programme expenditure  - Totex - Expenditure in report year - Water network+ Water treatment","£m","Cyclical Foundation","",0,0,"","","","","","","","",""]
["SES","B0441TGTE_DW","Total green recovery programme expenditure  - Totex - Expenditure in report year - Water network+ Treated water distribution","£m","Cyclical Foundation","",0,0,"","","","","","","","",""]
["SES","B0513TGTE_FOW","Total green recovery programme expenditure  - Totex - Expenditure in report year - Wastewater network+  Foul","£m","Cyclical Foundation","",0,0,"","","","","","","","",""]
["SES","B0520TGTE_SUW","Total green recovery programme expenditure  - Totex - Expenditure in report year - Wastewater network+  Surface water drainage","£m","Cyclical Foundation","",0,0,"","","","","","","","",""]
["SES","B0527TGTE_HDW","Total green recovery programme expenditure  - Totex - Expenditure in report year - Wastewater network+  Highway drainage","£m","Cyclical Foundation","",0,0,"","","","","","","","",""]
["SES","B0534TGTE_STW","Total green recovery programme expenditure  - Totex - Expenditure in report year - Wastewater network+  Sewage treatment and disposal","£m","Cyclical Foundation","",0,0,"","","","","","","","",""]
["SES","B0541TGTE_SLW","Total green recovery programme expenditure  - Totex - Expenditure in report year - Wastewater network+  Sludge liquor treatment","£m","Cyclical Foundation","",0,0,"","","","","","","","",""]
["SES","WS01008WR","Operating expenditure - Local authority and Cumulo rates - Water resources","£m","Cyclical Foundation",0.14726223408991901,0.80597300000000005,2.7876496569096999E-2,"","","","","","","","",""]
["SES","BM317WN","Local authority and Cumulo rates - Water Network+","£m","Cyclical Foundation",3.2285001709914098,1.785641,3.4056271096232602,"","","","","","","","",""]
["SES","BM817WNK","Local authority and Cumulo rates - Wastewater Network+","£m","Cyclical Foundation",0,0,0,"","","","","","","","",""]
["SES","BM817SG","Local authority and Cumulo rates - Sludge","£m","Cyclical Foundation",0,0,0,"","","","","","","","",""]
["SES","BM817TTT","Local authority rates - TTT","£m","Cyclical Foundation",0,0,"","","","","","","","","",""]
["SES","C_TBC_WR_PR19CA004_OFWAT","Total base costs exclude enhancemnt opex -  Water resources  - OFWAT view","£m","Price Review 2019","","","","","","","","","","","",23.900007861298899]
["SES","C_TBC_WN_PR19CA004_OFWAT","Total base costs exclude enhancemnt opex -  Water network plus  - OFWAT view","£m","Price Review 2019","","","","","","","","","","","",179.88054420377]
["SES","C_TBC_WBR_PR19CA008_OFWAT","Total base costs - Bioresources - OFWAT view","£m","Price Review 2019","","","","","","","","","","","",""]
["SES","C_TBC_WWN_PR19CA008_OFWAT","Total base costs - Wastewater network plus - OFWAT view","£m","Price Review 2019","","","","","","","","","","","",""]
["SES","C_UBC_WR_PR19CA004_OFWAT","Unmodelled base costs (Local authority and cumulo rates ) -  Water resources - OFWAT view","£m","Price Review 2019","","","","","","","","","","","",1.0175996438224]
["SES","C_UBC_WN_PR19CA004_OFWAT","Unmodelled base costs (Local authority and cumulo rates ) -  Water network plus - OFWAT view","£m","Price Review 2019","","","","","","","","","","","",14.139279261532399]
["SES","C_UBC_WBR_PR19CA008_OFWAT","Base costs - Unmodelled base costs (Local authority and cumulo rates ) -  Bioresources - OFWAT view","£m","Price Review 2019","","","","","","","","","","","",""]
["SES","C_UBC_WWN_PR19CA008_OFWAT","Base costs - Unmodelled base costs (Local authority and cumulo rates ) -  Wastewater network plus - OFWAT view","£m","Price Review 2019","","","","","","","","","","","",""]
["SES","WS1003_WW4_WR","Unmodelled base costs (Abstraction charges / discharge consent) WR","£m","Price Review 2019","","","","","","","","","","","",4.1378985288426398]
["SES","WS1003_WW4_WN","Unmodelled base costs (Abstraction charges / discharge consent) WN","£m","Price Review 2019","","","","","","","","","","","",0]
["SES","C_WWN_OUTPERFORM_001","Cost sharing rate for outperform","%","Price Review 2019","","","","","","","","","","","",0.65]
["SES","C_WWN_UNDERPERFORM_001","Cost sharing rate for underperform","%","Price Review 2019","","","","","","","","","","","",0.5]
["SES","B0012WR","Abstraction charges/ discharge consents - Water resources","£m","Cyclical Foundation",0.98281565999999998,0.498,1.0249999999999999,"","","","","","","","",""]
["SES","B0012WN","Abstraction charges/ discharge consents - Water Network+","£m","Cyclical Foundation",0,0,0,"","","","","","","","",""]
["SES","C_WR_CS_EXANTE_001","Ex-ante allowance above Ofwat forecast - Active - Water Resources","£m","Price Review 2019","","","","","","","","","","","",0]
["SES","C_WN_CS_EXANTE_001","Ex-ante allowance above Ofwat forecast - Active - Water Network","£m","Price Review 2019","","","","","","","","","","","",0]
["SES","C_WWN_CS_EXANTE_001","Ex-ante allowance above Ofwat forecast - Active - Wastewater Network","£m","Price Review 2019","","","","","","","","","","","",0]
["SES","C_WR_WN_OUTPERFORM_001","Cost sharing rate for outperform","%","Price Review 2019","","","","","","","","","","","",0.44631227029378201]
["SES","C_WR_WN_UNDERPERFORM_001","Cost sharing rate for underperform","%","Price Review 2019","","","","","","","","","","","",0.55368772970621805]

{"sheet":"F_Inputs","index":6,"n_rows":84,"n_cols":12,"rows_kept":84,"cut":false,"hidden":false,"merged":[]}
[null,null,"PR24 inputs for cost rec",null,"Run on 23 Apr 2024 15:43"]
["Acronym","Reference","Item description","Unit","Model","2020-21","2021-22","2022-23","2023-24","2024-25","2025-26","2020-25"]
[]
[null,null,null,null,null,"Price Review 2024","Price Review 2024","Price Review 2024","Price Review 2024","Price Review 2024","Price Review 2024","Price Review 2024"]
[null,null,null,null,null,"Run 10 - PR24 DD Data - All Batches","Run 10 - PR24 DD Data - All Batches","Run 10 - PR24 DD Data - All Batches","Run 10 - PR24 DD Data - All Batches","Run 10 - PR24 DD Data - All Batches","Run 10 - PR24 DD Data - All Batches","Run 10 - PR24 DD Data - All Batches"]
[null,null,null,null,null,"Latest","Latest","Latest","Latest","Latest","Latest","Latest"]
["WSX","B0143TAWR_PR24","Totex (net of business rates, abstraction licence fees and grants and contributions) - Total actual totex  (net of business rates, abstraction licence fees and grants and contributions) - Water resources","£m","Price Review 2024","","",13.416,17.672999999999998,14.632999999999999,"",""]
["WSX","B0143TAWNP_PR24","Totex (net of business rates, abstraction licence fees and grants and contributions) - Total actual totex  (net of business rates, abstraction licence fees and grants and contributions) - Water network plus","£m","Price Review 2024","","",131.114,133.66999999999999,109.57,"",""]
["WSX","B0143TAWWNP_PR24","Totex (net of business rates, abstraction licence fees and grants and contributions) - Total actual totex  (net of business rates, abstraction licence fees and grants and contributions) - Wastewater network plus","£m","Price Review 2024","","",262.85399999999998,329.50400000000002,315.52699999999999,"",""]
["WSX","B0143TABIO_PR24","Totex (net of business rates, abstraction licence fees and grants and contributions) - Total actual totex  (net of business rates, abstraction licence fees and grants and contributions) - Bioresources","£m","Price Review 2024","","",48.213999999999999,63.999000000000009,51.774000000000001,"",""]
["WSX","B0143TATTTH_PR24","Totex (net of business rates, abstraction licence fees and grants and contributions) - Total actual totex  (net of business rates, abstraction licence fees and grants and contributions) - Additional Control","£m","Price Review 2024","","",0,0,0,"",""]
["WSX","PD9_08WR_PR24","Totex - business rates and abstraction licence fees - Actual totex - business rates - Water resources","£m","Price Review 2024","","",0.97399999999999998,0.66700000000000004,0.64200000000000002,"",""]
["WSX","PD9_08WNP_PR24","Totex - business rates and abstraction licence fees - Actual totex - business rates - Water network plus","£m","Price Review 2024","","",14.994,10.257999999999999,9.8710000000000004,"",""]
["WSX","PD9_08WWNP_PR24","Totex - business rates and abstraction licence fees - Actual totex - business rates - Wastewater network plus","£m","Price Review 2024","","",7.1479999999999997,8.9939999999999998,8.6539999999999999,"",""]
["WSX","PD9_08BIO_PR24","Totex - business rates and abstraction licence fees - Actual totex - business rates - Bioresources","£m","Price Review 2024","","",1.6140000000000001,1.88,1.8089999999999999,"",""]
["WSX","PD9_08ADDN1_PR24","Totex - business rates and abstraction licence fees - Actual totex - business rates - Additional Control","£m","Price Review 2024","","",0,0,0,"",""]
["WSX","PD9_10WR_PR24","Totex - business rates and abstraction licence fees - Actual totex - abstraction licence fees - Water resources","£m","Price Review 2024","","",2.7320000000000002,2.7189999999999999,2.6509999999999998,"",""]
["WSX","PD9_10WNP_PR24","Totex - business rates and abstraction licence fees - Actual totex - abstraction licence fees - Water network plus","£m","Price Review 2024","","",0.152,0.14299999999999999,0.14000000000000001,"",""]
["WSX","PD9_10WWNP_PR24","Totex - business rates and abstraction licence fees - Actual totex - abstraction licence fees - Wastewater network plus","£m","Price Review 2024","","",0,0,0,"",""]
["WSX","PD9_10BIO_PR24","Totex - business rates and abstraction licence fees - Actual totex - abstraction licence fees - Bioresources","£m","Price Review 2024","","",0,0,0,"",""]
["WSX","PD9_10ADDN1_PR24","Totex - business rates and abstraction licence fees - Actual totex - abstraction licence fees - Additional Control","£m","Price Review 2024","","",0,0,0,"",""]
["WSX","PD9_13WR_PR24","CMA companies only – items excluded from general cost sharing with bespoke sharing rates - Company cost sharing rates  - Water resources","%","Price Review 2024","","",0,0,0,"",""]
["WSX","PD9_13WNP_PR24","CMA companies only – items excluded from general cost sharing with bespoke sharing rates - Company cost sharing rates  - Water network plus","%","Price Review 2024","","",0,0,0,"",""]
["WSX","PD9_13WWNP_PR24","CMA companies only – items excluded from general cost sharing with bespoke sharing rates - Company cost sharing rates  - Wastewater network plus","%","Price Review 2024","","",0,0,0,"",""]
["WSX","PD9_13BIO_PR24","CMA companies only – items excluded from general cost sharing with bespoke sharing rates - Company cost sharing rates  - Bioresources","%","Price Review 2024","","",0,0,0,"",""]
["WSX","PD9_13ADDN1_PR24","CMA companies only – items excluded from general cost sharing with bespoke sharing rates - Company cost sharing rates  - Additional Control","%","Price Review 2024","","",0,0,0,"",""]
["WSX","B0413TGTE_WR_PR24","Green recovery programme - Total green recovery programme expenditure - Totex - Water resources - Expenditure in report year","£m","Price Review 2024","","",0,0,0,0,""]
["WSX","B0420TGTE_RW_PR24","Green recovery programme - Total green recovery programme expenditure - Totex - Raw water transport - Water network+ - Expenditure in report year","£m","Price Review 2024","","",0,0,0,0,""]
["WSX","B0427TGTE_SW_PR24","Green recovery programme - Total green recovery programme expenditure - Totex - Raw water storage - Water network+ - Expenditure in report year","£m","Price Review 2024","","",0,0,0,0,""]
["WSX","B0434TGTE_TW_PR24","Green recovery programme - Total green recovery programme expenditure - Totex - Water treatment - Water network+ - Expenditure in report year","£m","Price Review 2024","","",0,0,0,0,""]
["WSX","B0441TGTE_DW_PR24","Green recovery programme - Total green recovery programme expenditure - Totex - Treated water distribution - Water network+ - Expenditure in report year","£m","Price Review 2024","","",0,0,0,0,""]
["WSX","B0513TGTE_FOW_PR24","Green recovery programme - Total green recovery programme expenditure - Totex - Foul - Wastewater network+  - Expenditure in report year","£m","Price Review 2024","","",0,0,0,0,""]
["WSX","B0520TGTE_SUW_PR24","Green recovery programme - Total green recovery programme expenditure - Totex - Surface water drainage - Wastewater network+  - Expenditure in report year","£m","Price Review 2024","","",0,0,0,0,""]
["WSX","B0527TGTE_HDW_PR24","Green recovery programme - Total green recovery programme expenditure - Totex - Highway drainage - Wastewater network+  - Expenditure in report year","£m","Price Review 2024","","",0,0,0,0,""]
["WSX","B0534TGTE_STW_PR24","Green recovery programme - Total green recovery programme expenditure - Totex - Sewage treatment and disposal - Wastewater network+  - Expenditure in report year","£m","Price Review 2024","","",0,0,0,0,""]
["WSX","B0541TGTE_SLW_PR24","Green recovery programme - Total green recovery programme expenditure - Totex - Sludge liquor treatment - Wastewater network+  - Expenditure in report year","£m","Price Review 2024","","",0,0,0,0,""]
["WSX","B0547TGTE_SAB_PR24","Green recovery programme - Total green recovery programme expenditure - Totex - Sludge transport - Bioresources - Expenditure in report year","£m","Price Review 2024","","",0,0,0,0,""]
["WSX","B0554TGTE_SEB_PR24","Green recovery programme - Total green recovery programme expenditure - Totex - Sludge treatment - Bioresources - Expenditure in report year","£m","Price Review 2024","","",0,0,0,0,""]
["WSX","B0561TGTE_SDB_PR24","Green recovery programme - Total green recovery programme expenditure - Totex - Sludge disposal - Bioresources - Expenditure in report year","£m","Price Review 2024","","",0,0,0,0,""]
["WSX","BB3905AL_PR24","Consumer price index (including housing costs) - Consumer Price Index (with housing) for April","nr","Price Review 2024",108.6,110.4,119,128.30000000000001,132.19176666666669,134.83560199999999,""]
["WSX","BB3905MY_PR24","Consumer price index (including housing costs) - Consumer Price Index (with housing) for May","nr","Price Review 2024",108.6,111,119.7,129.1,132.62873333333329,135.281308,""]
["WSX","BB3905JN_PR24","Consumer price index (including housing costs) - Consumer Price Index (with housing) for June","nr","Price Review 2024",108.8,111.4,120.5,129.417,132.78184200000001,135.43747884000001,""]
["WSX","BB3905JL_PR24","Consumer price index (including housing costs) - Consumer Price Index (with housing) for July","nr","Price Review 2024",109.2,111.4,121.2,128.95679999999999,132.825504,135.48201408,""]
["WSX","BB3905AT_PR24","Consumer price index (including housing costs) - Consumer Price Index (with housing) for August","nr","Price Review 2024",108.8,112.1,121.8,129.71700000000001,133.392315,136.0601613,""]
["WSX","BB3905SR_PR24","Consumer price index (including housing costs) - Consumer Price Index (with housing) for September","nr","Price Review 2024",109.2,112.4,122.3,130.0456666666667,133.60024822222221,136.27225318666669,""]
["WSX","BB3905OR_PR24","Consumer price index (including housing costs) - Consumer Price Index (with housing) for October","nr","Price Review 2024",109.2,113.4,124.3,130.34926666666661,133.8686968666666,136.54607080400001,""]
["WSX","BB3905NR_PR24","Consumer price index (including housing costs) - Consumer Price Index (with housing) for November","nr","Price Review 2024",109.1,114.1,124.8,130.7072,134.1927253333333,136.87657984000001,""]
["WSX","BB3905DR_PR24","Consumer price index (including housing costs) - Consumer Price Index (with housing) for December","nr","Price Review 2024",109.4,114.7,125.3,130.9385,134.34290100000001,137.02975902,""]
["WSX","BB3905JY_PR24","Consumer price index (including housing costs) - Consumer Price Index (with housing) for January","nr","Price Review 2024",109.3,114.6,124.8,130.54079999999999,133.15161599999999,135.81464832,""]
["WSX","BB3905FY_PR24","Consumer price index (including housing costs) - Consumer Price Index (with housing) for February","nr","Price Review 2024",109.4,115.4,126,131.124,133.74647999999999,136.4214096,""]
["WSX","BB3905MH_PR24","Consumer price index (including housing costs) - Consumer Price Index (with housing) for March","nr","Price Review 2024",109.7,116.5,126.8,131.49160000000001,134.121432,136.80386064000001,""]
["WSX","C_OPEX_SPLIT_BASE_WR_PR19CA091","PR19 Opex split profile - Base costs - WR","%","Price Review 2024",0.14434578369805173,0.14983284433448402,0.16636012381742027,0.14991393612749104,0.15116814522775562,"",""]
["WSX","C_OPEX_SPLIT_BASE_WN_PR19CA091","PR19 Opex split profile - Base costs - WN","%","Price Review 2024",0.13011967333551938,0.13002087025377404,0.12991258907663342,0.12983750820712892,0.12995627086656975,"",""]
["WSX","C_OPEX_SPLIT_BASE_WWN_PR19CA091","PR19 Opex split profile - Base costs - WWN","%","Price Review 2024",9.047609179195612E-2,9.1390104613101833E-2,9.2172540822842694E-2,9.3052151436181785E-2,9.3991545305283045E-2,"",""]
["WSX","C_OPEX_SPLIT_BASE_BR_PR19CA091","PR19 Opex split profile - Base costs - BR","%","Price Review 2024",0.14557448148837213,0.14625672704593445,0.14694921226875687,0.14765209283482697,0.14797801216352618,"",""]
["WSX","C_OPEX_SPLIT_BASE_DMMY_PR19CA091","PR19 Opex split profile - Base costs - DMMY","%","Price Review 2024",0,0,0,0,0,"",""]
["WSX","C_CAPEX_SPLIT_BASE_WR_PR19CA091","PR19 Capex Split Profile - Base costs - WR","%","Price Review 2024",4.6275016569606399E-2,6.8844429679159908E-2,5.5149711608228479E-2,3.4161867220366939E-2,3.3948141717435654E-2,"",""]
["WSX","C_CAPEX_SPLIT_BASE_WN_PR19CA091","PR19 Capex Split Profile - Base costs - WN","%","Price Review 2024",6.8701218353916724E-2,6.0376187471391306E-2,9.7088933530360813E-2,6.6895156017971302E-2,5.7091592886734335E-2,"",""]
["WSX","C_CAPEX_SPLIT_BASE_WWN_PR19CA091","PR19 Capex Split Profile - Base costs - WWN","%","Price Review 2024",0.10044156863790089,0.10778551749852774,0.10896123816846381,0.11358201045160943,0.10814723127413269,"",""]
["WSX","C_CAPEX_SPLIT_BASE_BR_PR19CA091","PR19 Capex Split Profile - Base costs - BR","%","Price Review 2024",5.2590708679648983E-2,4.5834751586344952E-2,6.3555294781896726E-2,4.4372806772711854E-2,5.9235912377980968E-2,"",""]
["WSX","C_CAPEX_SPLIT_BASE_DMMY_PR19CA091","PR19 Capex Split Profile - Base costs - DMMY","%","Price Review 2024",0,0,0,0,0,"",""]
["WSX","C_PR19_E_WW_WINEP_WWN","PR19 - WINEP in the round for cost reconciliation - WWN","£m","Price Review 2024","","","","","","",384.05531144354427]
["WSX","C_PR19_E_W_METERING_WN","PR19 - metering for cost reconciliation - WN","£m","Price Review 2024","","","","","","",10.924016350800313]
["WSX","C__PR24PD11_PD11_12WR_PRETVM_PR24","PR19 WINEP / NEP RCV adjustment in 2017-18 FYA (CPIH deflated) prices (WR) - Pre time value of money adjustment","£m","Price Review 2024","","",0,0,0,"",0]
["WSX","C__PR24PD11_PD11_12WN_PRETVM_PR24","PR19 WINEP / NEP RCV adjustment in 2017-18 FYA (CPIH deflated) prices (WN)  - Pre time value of money adjustment","£m","Price Review 2024","","",0,0,0,"",0]
["WSX","C__PR24PD11_PD11_12WWN_PRETVM_PR24","PR19 WINEP / NEP RCV adjustment in 2017-18 FYA (CPIH deflated) prices (WWN) - Pre time value of money adjustment","£m","Price Review 2024","","",-3.5539224000000029,-3.5539224000000029,-3.5539224000000029,"",-10.661767200000009]
["WSX","C__PR24PD11_PD11_12BIO_PRETVM_PR24","PR19 WINEP / NEP RCV adjustment in 2017-18 FYA (CPIH deflated) prices (BR) - Pre time value of money adjustment","£m","Price Review 2024","","",0,0,0,"",0]
["WSX","C__PR24PD11_PD11_12ADDN1_PRETVM_PR24","PR19 WINEP / NEP RCV adjustment in 2017-18 FYA (CPIH deflated) prices (ADDN1) - Pre time value of money adjustment","£m","Price Review 2024","","",0,0,0,"",0]
["WSX","C_PR24PD11_PD11_12ADDN2_PR24","PR19 WINEP / NEP RCV adjustment in 2017-18 FYA (CPIH deflated) prices (ADDN2)","£m","Price Review 2024","","","","","","",""]
["WSX","C_PR24PD21_01WR_PR24","Total adjusted cost allowance - WR - real","£m","Price Review 2024","","","","","","",""]
["WSX","C_PR24PD21_01WN_PR24","Total adjusted cost allowance - WN+ - real","£m","Price Review 2024","","","","","","",""]
["WSX","C_PR24PD21_01WWN_PR24","Total adjusted cost allowance - WWN+ - real","£m","Price Review 2024","","","","","","",""]
["WSX","C_PR24PD21_01BIO_PR24","Total adjusted cost allowance - BR - real","£m","Price Review 2024","","","","","","",""]
["WSX","PD9_11WR_PR24","CMA companies only – items excluded from general cost sharing with bespoke sharing rates - CMA final determination allowed totex – items with bespoke sharing rates  - Water resources","£m","Price Review 2024","","",0,0,0,"",""]
["WSX","PD9_11WNP_PR24","CMA companies only – items excluded from general cost sharing with bespoke sharing rates - CMA final determination allowed totex – items with bespoke sharing rates  - Water network plus","£m","Price Review 2024","","",0,0,0,"",""]
["WSX","PD9_11WWNP_PR24","CMA companies only – items excluded from general cost sharing with bespoke sharing rates - CMA final determination allowed totex – items with bespoke sharing rates  - Wastewater network plus","£m","Price Review 2024","","",0,0,0,"",""]
["WSX","PD9_11BIO_PR24","CMA companies only – items excluded from general cost sharing with bespoke sharing rates - CMA final determination allowed totex – items with bespoke sharing rates  - Bioresources","£m","Price Review 2024","","",0,0,0,"",""]
["WSX","PD9_11ADDN1_PR24","CMA companies only – items excluded from general cost sharing with bespoke sharing rates - CMA final determination allowed totex – items with bespoke sharing rates  - Additional Control","£m","Price Review 2024","","",0,0,0,"",""]
["WSX","PD9_12WR_PR24","CMA companies only – items excluded from general cost sharing with bespoke sharing rates - Actual totex – items with bespoke sharing rates - Water resources","£m","Price Review 2024","","",0,0,0,"",""]
["WSX","PD9_12WNP_PR24","CMA companies only – items excluded from general cost sharing with bespoke sharing rates - Actual totex – items with bespoke sharing rates - Water network plus","£m","Price Review 2024","","",0,0,0,"",""]
["WSX","PD9_12WWNP_PR24","CMA companies only – items excluded from general cost sharing with bespoke sharing rates - Actual totex – items with bespoke sharing rates - Wastewater network plus","£m","Price Review 2024","","",0,0,0,"",""]
["WSX","PD9_12BIO_PR24","CMA companies only – items excluded from general cost sharing with bespoke sharing rates - Actual totex – items with bespoke sharing rates - Bioresources","£m","Price Review 2024","","",0,0,0,"",""]
["WSX","PD9_12ADDN1_PR24","CMA companies only – items excluded from general cost sharing with bespoke sharing rates - Actual totex – items with bespoke sharing rates - Additional Control","£m","Price Review 2024","","",0,0,0,"",""]
["WSX","C_PR19_E_WW_WINEP_BIO","PR19 - WINEP in the round for cost reconciliation - BIO","£m","Price Review 2024","","","","","","",0]

{"sheet":"Consolidated actual totex inp","index":7,"n_rows":83,"n_cols":12,"rows_kept":83,"cut":false,"hidden":false,"merged":[]}
["Company acronym",null,null,null,"WSX",null,{"$f":"'F_Inputs-APR & PR19'!F6","v":"2020-21"},{"$f":"'F_Inputs-APR & PR19'!G6","v":"2021-22"},{"$f":"'F_Inputs-APR & PR19'!H6","v":"2022-23"},{"$f":"'F_Inputs-APR & PR19'!I6","v":"2023-24"},{"$f":"'F_Inputs-APR & PR19'!J6","v":"2024-25"}]
[null,null,null,null,null,"CPIH fin year ave",{"$f":"AVERAGE(F_Inputs!F40:F51)","v":109.10833333333335},{"$f":"AVERAGE(F_Inputs!G40:G51)","v":113.11666666666667},{"$f":"AVERAGE(F_Inputs!H40:H51)","v":123.04166666666664},{"$f":"AVERAGE(F_Inputs!I40:I51)","v":130.05731944444446},{"$f":"AVERAGE(F_Inputs!J40:J51)","v":133.40368836851852}]
[null,null,null,null,null,"Conversion factor for business plan totex from 22-23 real to nominal",null,null,{"$f":"I2/$I$2","v":1},{"$f":"J2/$I$2","v":1.0570185122474323},1.0842155505738047]
[null,null,null,"Data before override"]
[null,"B0143TAWR","B0143TAWR_PR24",null,null,"Totex (net of business rates, abstraction licence fees and grants and contributions) - Total actual totex  (net of business rates, abstraction licence fees and grants and contributions) - Water resources",{"$f":"SUMIFS('F_Inputs-APR & PR19'!F:F, 'F_Inputs-APR & PR19'!$A:$A, 'Consolidated actual totex inp'!$E$1, 'F_Inputs-APR & PR19'!$B:$B, 'Consolidated actual totex inp'!$B5)","v":9.2840000000000007},{"$f":"SUMIFS('F_Inputs-APR & PR19'!G:G, 'F_Inputs-APR & PR19'!$A:$A, 'Consolidated actual totex inp'!$E$1, 'F_Inputs-APR & PR19'!$B:$B, 'Consolidated actual totex inp'!$B5)","v":10.571},{"$f":"SUMIFS(F_Inputs!H:H, F_Inputs!$A:$A, 'Consolidated actual totex inp'!$E$1, F_Inputs!$B:$B, 'Consolidated actual totex inp'!$C5)*'Consolidated actual totex inp'!I$3","v":13.416},{"$f":"SUMIFS(F_Inputs!I:I, F_Inputs!$A:$A, 'Consolidated actual totex inp'!$E$1, F_Inputs!$B:$B, 'Consolidated actual totex inp'!$C5)*'Consolidated actual totex inp'!J$3","v":18.680688166948869},{"$f":"SUMIFS(F_Inputs!J:J, F_Inputs!$A:$A, 'Consolidated actual totex inp'!$E$1, F_Inputs!$B:$B, 'Consolidated actual totex inp'!$C5)*'Consolidated actual totex inp'!K$3","v":15.865326151546483}]
[null,"B0143TAWNP","B0143TAWNP_PR24",null,null,"Totex (net of business rates, abstraction licence fees and grants and contributions) - Total actual totex  (net of business rates, abstraction licence fees and grants and contributions) - Water network plus",{"$f":"SUMIFS('F_Inputs-APR & PR19'!F:F, 'F_Inputs-APR & PR19'!$A:$A, 'Consolidated actual totex inp'!$E$1, 'F_Inputs-APR & PR19'!$B:$B, 'Consolidated actual totex inp'!$B6)","v":119.90600000000001},{"$f":"SUMIFS('F_Inputs-APR & PR19'!G:G, 'F_Inputs-APR & PR19'!$A:$A, 'Consolidated actual totex inp'!$E$1, 'F_Inputs-APR & PR19'!$B:$B, 'Consolidated actual totex inp'!$B6)","v":118.23},{"$f":"SUMIFS(F_Inputs!H:H, F_Inputs!$A:$A, 'Consolidated actual totex inp'!$E$1, F_Inputs!$B:$B, 'Consolidated actual totex inp'!$C6)*'Consolidated actual totex inp'!I$3","v":131.114},{"$f":"SUMIFS(F_Inputs!I:I, F_Inputs!$A:$A, 'Consolidated actual totex inp'!$E$1, F_Inputs!$B:$B, 'Consolidated actual totex inp'!$C6)*'Consolidated actual totex inp'!J$3","v":141.29166453211425},{"$f":"SUMIFS(F_Inputs!J:J, F_Inputs!$A:$A, 'Consolidated actual totex inp'!$E$1, F_Inputs!$B:$B, 'Consolidated actual totex inp'!$C6)*'Consolidated actual totex inp'!K$3","v":118.79749787637178}]
[null,"B0143TAWWNP","B0143TAWWNP_PR24",null,null,"Totex (net of business rates, abstraction licence fees and grants and contributions) - Total actual totex  (net of business rates, abstraction licence fees and grants and contributions) - Wastewater network plus",{"$f":"SUMIFS('F_Inputs-APR & PR19'!F:F, 'F_Inputs-APR & PR19'!$A:$A, 'Consolidated actual totex inp'!$E$1, 'F_Inputs-APR & PR19'!$B:$B, 'Consolidated actual totex inp'!$B7)","v":237.078},{"$f":"SUMIFS('F_Inputs-APR & PR19'!G:G, 'F_Inputs-APR & PR19'!$A:$A, 'Consolidated actual totex inp'!$E$1, 'F_Inputs-APR & PR19'!$B:$B, 'Consolidated actual totex inp'!$B7)","v":235.87299999999999},{"$f":"SUMIFS(F_Inputs!H:H, F_Inputs!$A:$A, 'Consolidated actual totex inp'!$E$1, F_Inputs!$B:$B, 'Consolidated actual totex inp'!$C7)*'Consolidated actual totex inp'!I$3","v":262.85399999999998},{"$f":"SUMIFS(F_Inputs!I:I, F_Inputs!$A:$A, 'Consolidated actual totex inp'!$E$1, F_Inputs!$B:$B, 'Consolidated actual totex inp'!$C7)*'Consolidated actual totex inp'!J$3","v":348.29182785957795},{"$f":"SUMIFS(F_Inputs!J:J, F_Inputs!$A:$A, 'Consolidated actual totex inp'!$E$1, F_Inputs!$B:$B, 'Consolidated actual totex inp'!$C7)*'Consolidated actual totex inp'!K$3","v":342.09928002590084}]
[null,"B0143TATTTH","B0143TATTTH_PR24",null,null,"Totex (net of business rates, abstraction licence fees and grants and contributions) - Total actual totex  (net of business rates, abstraction licence fees and grants and contributions) - Additional Control",{"$f":"SUMIFS('F_Inputs-APR & PR19'!F:F, 'F_Inputs-APR & PR19'!$A:$A, 'Consolidated actual totex inp'!$E$1, 'F_Inputs-APR & PR19'!$B:$B, 'Consolidated actual totex inp'!$B8)","v":0},{"$f":"SUMIFS('F_Inputs-APR & PR19'!G:G, 'F_Inputs-APR & PR19'!$A:$A, 'Consolidated actual totex inp'!$E$1, 'F_Inputs-APR & PR19'!$B:$B, 'Consolidated actual totex inp'!$B8)","v":0},{"$f":"SUMIFS(F_Inputs!H:H, F_Inputs!$A:$A, 'Consolidated actual totex inp'!$E$1, F_Inputs!$B:$B, 'Consolidated actual totex inp'!$C8)*'Consolidated actual totex inp'!I$3","v":0},{"$f":"SUMIFS(F_Inputs!I:I, F_Inputs!$A:$A, 'Consolidated actual totex inp'!$E$1, F_Inputs!$B:$B, 'Consolidated actual totex inp'!$C8)*'Consolidated actual totex inp'!J$3","v":0},{"$f":"SUMIFS(F_Inputs!J:J, F_Inputs!$A:$A, 'Consolidated actual totex inp'!$E$1, F_Inputs!$B:$B, 'Consolidated actual totex inp'!$C8)*'Consolidated actual totex inp'!K$3","v":0}]
[null,"WS01008WR","PD9_08WR_PR24",null,null,"Totex - business rates and abstraction licence fees - Actual totex - business rates - Water resources",{"$f":"SUMIFS('F_Inputs-APR & PR19'!F:F, 'F_Inputs-APR & PR19'!$A:$A, 'Consolidated actual totex inp'!$E$1, 'F_Inputs-APR & PR19'!$B:$B, 'Consolidated actual totex inp'!$B9)","v":0.96764071120538497},{"$f":"SUMIFS('F_Inputs-APR & PR19'!G:G, 'F_Inputs-APR & PR19'!$A:$A, 'Consolidated actual totex inp'!$E$1, 'F_Inputs-APR & PR19'!$B:$B, 'Consolidated actual totex inp'!$B9)","v":0.96138774503593805},{"$f":"SUMIFS(F_Inputs!H:H, F_Inputs!$A:$A, 'Consolidated actual totex inp'!$E$1, F_Inputs!$B:$B, 'Consolidated actual totex inp'!$C9)*'Consolidated actual totex inp'!I$3","v":0.97399999999999998},{"$f":"SUMIFS(F_Inputs!I:I, F_Inputs!$A:$A, 'Consolidated actual totex inp'!$E$1, F_Inputs!$B:$B, 'Consolidated actual totex inp'!$C9)*'Consolidated actual totex inp'!J$3","v":0.70503134766903741},{"$f":"SUMIFS(F_Inputs!J:J, F_Inputs!$A:$A, 'Consolidated actual totex inp'!$E$1, F_Inputs!$B:$B, 'Consolidated actual totex inp'!$C9)*'Consolidated actual totex inp'!K$3","v":0.69606638346838268}]
[null,"BM317WN","PD9_08WNP_PR24",null,null,"Totex - business rates and abstraction licence fees - Actual totex - business rates - Water network plus",{"$f":"SUMIFS('F_Inputs-APR & PR19'!F:F, 'F_Inputs-APR & PR19'!$A:$A, 'Consolidated actual totex inp'!$E$1, 'F_Inputs-APR & PR19'!$B:$B, 'Consolidated actual totex inp'!$B10)","v":15.0517525785476},{"$f":"SUMIFS('F_Inputs-APR & PR19'!G:G, 'F_Inputs-APR & PR19'!$A:$A, 'Consolidated actual totex inp'!$E$1, 'F_Inputs-APR & PR19'!$B:$B, 'Consolidated actual totex inp'!$B10)","v":14.929807562819301},{"$f":"SUMIFS(F_Inputs!H:H, F_Inputs!$A:$A, 'Consolidated actual totex inp'!$E$1, F_Inputs!$B:$B, 'Consolidated actual totex inp'!$C10)*'Consolidated actual totex inp'!I$3","v":14.994},{"$f":"SUMIFS(F_Inputs!I:I, F_Inputs!$A:$A, 'Consolidated actual totex inp'!$E$1, F_Inputs!$B:$B, 'Consolidated actual totex inp'!$C10)*'Consolidated actual totex inp'!J$3","v":10.842895898634159},{"$f":"SUMIFS(F_Inputs!J:J, F_Inputs!$A:$A, 'Consolidated actual totex inp'!$E$1, F_Inputs!$B:$B, 'Consolidated actual totex inp'!$C10)*'Consolidated actual totex inp'!K$3","v":10.702291699714026}]
[null,"BM817WNK","PD9_08WWNP_PR24",null,null,"Totex - business rates and abstraction licence fees - Actual totex - business rates - Wastewater network plus",{"$f":"SUMIFS('F_Inputs-APR & PR19'!F:F, 'F_Inputs-APR & PR19'!$A:$A, 'Consolidated actual totex inp'!$E$1, 'F_Inputs-APR & PR19'!$B:$B, 'Consolidated actual totex inp'!$B11)","v":7.1502332510739697},{"$f":"SUMIFS('F_Inputs-APR & PR19'!G:G, 'F_Inputs-APR & PR19'!$A:$A, 'Consolidated actual totex inp'!$E$1, 'F_Inputs-APR & PR19'!$B:$B, 'Consolidated actual totex inp'!$B11)","v":7.1476199182773197},{"$f":"SUMIFS(F_Inputs!H:H, F_Inputs!$A:$A, 'Consolidated actual totex inp'!$E$1, F_Inputs!$B:$B, 'Consolidated actual totex inp'!$C11)*'Consolidated actual totex inp'!I$3","v":7.1479999999999997},{"$f":"SUMIFS(F_Inputs!I:I, F_Inputs!$A:$A, 'Consolidated actual totex inp'!$E$1, F_Inputs!$B:$B, 'Consolidated actual totex inp'!$C11)*'Consolidated actual totex inp'!J$3","v":9.5068244991534048},{"$f":"SUMIFS(F_Inputs!J:J, F_Inputs!$A:$A, 'Consolidated actual totex inp'!$E$1, F_Inputs!$B:$B, 'Consolidated actual totex inp'!$C11)*'Consolidated actual totex inp'!K$3","v":9.3828013746657053}]
[null,"BM817SG","PD9_08BIO_PR24",null,null,"Totex - business rates and abstraction licence fees - Actual totex - business rates - Bioresources",{"$f":"SUMIFS('F_Inputs-APR & PR19'!F:F, 'F_Inputs-APR & PR19'!$A:$A, 'Consolidated actual totex inp'!$E$1, 'F_Inputs-APR & PR19'!$B:$B, 'Consolidated actual totex inp'!$B12)","v":1.64603258293165},{"$f":"SUMIFS('F_Inputs-APR & PR19'!G:G, 'F_Inputs-APR & PR19'!$A:$A, 'Consolidated actual totex inp'!$E$1, 'F_Inputs-APR & PR19'!$B:$B, 'Consolidated actual totex inp'!$B12)","v":1.61860586852216},{"$f":"SUMIFS(F_Inputs!H:H, F_Inputs!$A:$A, 'Consolidated actual totex inp'!$E$1, F_Inputs!$B:$B, 'Consolidated actual totex inp'!$C12)*'Consolidated actual totex inp'!I$3","v":1.6140000000000001},{"$f":"SUMIFS(F_Inputs!I:I, F_Inputs!$A:$A, 'Consolidated actual totex inp'!$E$1, F_Inputs!$B:$B, 'Consolidated actual totex inp'!$C12)*'Consolidated actual totex inp'!J$3","v":1.9871948030251725},{"$f":"SUMIFS(F_Inputs!J:J, F_Inputs!$A:$A, 'Consolidated actual totex inp'!$E$1, F_Inputs!$B:$B, 'Consolidated actual totex inp'!$C12)*'Consolidated actual totex inp'!K$3","v":1.9613459309880126}]
[null,"BM817TTT","PD9_08ADDN1_PR24",null,null,"Totex - business rates and abstraction licence fees - Actual totex - business rates - Additional Control",{"$f":"SUMIFS('F_Inputs-APR & PR19'!F:F, 'F_Inputs-APR & PR19'!$A:$A, 'Consolidated actual totex inp'!$E$1, 'F_Inputs-APR & PR19'!$B:$B, 'Consolidated actual totex inp'!$B13)","v":0},{"$f":"SUMIFS('F_Inputs-APR & PR19'!G:G, 'F_Inputs-APR & PR19'!$A:$A, 'Consolidated actual totex inp'!$E$1, 'F_Inputs-APR & PR19'!$B:$B, 'Consolidated actual totex inp'!$B13)","v":0},{"$f":"SUMIFS(F_Inputs!H:H, F_Inputs!$A:$A, 'Consolidated actual totex inp'!$E$1, F_Inputs!$B:$B, 'Consolidated actual totex inp'!$C13)*'Consolidated actual totex inp'!I$3","v":0},{"$f":"SUMIFS(F_Inputs!I:I, F_Inputs!$A:$A, 'Consolidated actual totex inp'!$E$1, F_Inputs!$B:$B, 'Consolidated actual totex inp'!$C13)*'Consolidated actual totex inp'!J$3","v":0},{"$f":"SUMIFS(F_Inputs!J:J, F_Inputs!$A:$A, 'Consolidated actual totex inp'!$E$1, F_Inputs!$B:$B, 'Consolidated actual totex inp'!$C13)*'Consolidated actual totex inp'!K$3","v":0}]
[null,"B0012WR","PD9_10WR_PR24",null,null,"Totex - business rates and abstraction licence fees - Actual totex - abstraction licence fees - Water resources",{"$f":"SUMIFS('F_Inputs-APR & PR19'!F:F, 'F_Inputs-APR & PR19'!$A:$A, 'Consolidated actual totex inp'!$E$1, 'F_Inputs-APR & PR19'!$B:$B, 'Consolidated actual totex inp'!$B14)","v":2.47946263753408},{"$f":"SUMIFS('F_Inputs-APR & PR19'!G:G, 'F_Inputs-APR & PR19'!$A:$A, 'Consolidated actual totex inp'!$E$1, 'F_Inputs-APR & PR19'!$B:$B, 'Consolidated actual totex inp'!$B14)","v":2.5835450156070401},{"$f":"SUMIFS(F_Inputs!H:H, F_Inputs!$A:$A, 'Consolidated actual totex inp'!$E$1, F_Inputs!$B:$B, 'Consolidated actual totex inp'!$C14)*'Consolidated actual totex inp'!I$3","v":2.7320000000000002},{"$f":"SUMIFS(F_Inputs!I:I, F_Inputs!$A:$A, 'Consolidated actual totex inp'!$E$1, F_Inputs!$B:$B, 'Consolidated actual totex inp'!$C14)*'Consolidated actual totex inp'!J$3","v":2.8740333348007683},{"$f":"SUMIFS(F_Inputs!J:J, F_Inputs!$A:$A, 'Consolidated actual totex inp'!$E$1, F_Inputs!$B:$B, 'Consolidated actual totex inp'!$C14)*'Consolidated actual totex inp'!K$3","v":2.8742554245711562}]
[null,"B0012WN","PD9_10WNP_PR24",null,null,"Totex - business rates and abstraction licence fees - Actual totex - abstraction licence fees - Water network plus",{"$f":"SUMIFS('F_Inputs-APR & PR19'!F:F, 'F_Inputs-APR & PR19'!$A:$A, 'Consolidated actual totex inp'!$E$1, 'F_Inputs-APR & PR19'!$B:$B, 'Consolidated actual totex inp'!$B15)","v":0.142499230322811},{"$f":"SUMIFS('F_Inputs-APR & PR19'!G:G, 'F_Inputs-APR & PR19'!$A:$A, 'Consolidated actual totex inp'!$E$1, 'F_Inputs-APR & PR19'!$B:$B, 'Consolidated actual totex inp'!$B15)","v":0.14298974377236701},{"$f":"SUMIFS(F_Inputs!H:H, F_Inputs!$A:$A, 'Consolidated actual totex inp'!$E$1, F_Inputs!$B:$B, 'Consolidated actual totex inp'!$C15)*'Consolidated actual totex inp'!I$3","v":0.152},{"$f":"SUMIFS(F_Inputs!I:I, F_Inputs!$A:$A, 'Consolidated actual totex inp'!$E$1, F_Inputs!$B:$B, 'Consolidated actual totex inp'!$C15)*'Consolidated actual totex inp'!J$3","v":0.15115364725138281},{"$f":"SUMIFS(F_Inputs!J:J, F_Inputs!$A:$A, 'Consolidated actual totex inp'!$E$1, F_Inputs!$B:$B, 'Consolidated actual totex inp'!$C15)*'Consolidated actual totex inp'!K$3","v":0.15179017708033268}]
[null,"B0413TGTE_WR","B0413TGTE_WR_PR24",null,null,"Green recovery programme - Total green recovery programme expenditure - Totex - Water resources - Expenditure in report year",{"$f":"SUMIFS('F_Inputs-APR & PR19'!F:F, 'F_Inputs-APR & PR19'!$A:$A, 'Consolidated actual totex inp'!$E$1, 'F_Inputs-APR & PR19'!$B:$B, 'Consolidated actual totex inp'!$B16)","v":0},{"$f":"SUMIFS('F_Inputs-APR & PR19'!G:G, 'F_Inputs-APR & PR19'!$A:$A, 'Consolidated actual totex inp'!$E$1, 'F_Inputs-APR & PR19'!$B:$B, 'Consolidated actual totex inp'!$B16)","v":0},{"$f":"SUMIFS(F_Inputs!H:H, F_Inputs!$A:$A, 'Consolidated actual totex inp'!$E$1, F_Inputs!$B:$B, 'Consolidated actual totex inp'!$C16)*'Consolidated actual totex inp'!I$3","v":0},{"$f":"SUMIFS(F_Inputs!I:I, F_Inputs!$A:$A, 'Consolidated actual totex inp'!$E$1, F_Inputs!$B:$B, 'Consolidated actual totex inp'!$C16)*'Consolidated actual totex inp'!J$3","v":0},{"$f":"SUMIFS(F_Inputs!J:J, F_Inputs!$A:$A, 'Consolidated actual totex inp'!$E$1, F_Inputs!$B:$B, 'Consolidated actual totex inp'!$C16)*'Consolidated actual totex inp'!K$3","v":0}]
[null,"B0420TGTE_RW","B0420TGTE_RW_PR24",null,null,"Green recovery programme - Total green recovery programme expenditure - Totex - Raw water transport - Water network+ - Expenditure in report year",{"$f":"SUMIFS('F_Inputs-APR & PR19'!F:F, 'F_Inputs-APR & PR19'!$A:$A, 'Consolidated actual totex inp'!$E$1, 'F_Inputs-APR & PR19'!$B:$B, 'Consolidated actual totex inp'!$B17)","v":0},{"$f":"SUMIFS('F_Inputs-APR & PR19'!G:G, 'F_Inputs-APR & PR19'!$A:$A, 'Consolidated actual totex inp'!$E$1, 'F_Inputs-APR & PR19'!$B:$B, 'Consolidated actual totex inp'!$B17)","v":0},{"$f":"SUMIFS(F_Inputs!H:H, F_Inputs!$A:$A, 'Consolidated actual totex inp'!$E$1, F_Inputs!$B:$B, 'Consolidated actual totex inp'!$C17)*'Consolidated actual totex inp'!I$3","v":0},{"$f":"SUMIFS(F_Inputs!I:I, F_Inputs!$A:$A, 'Consolidated actual totex inp'!$E$1, F_Inputs!$B:$B, 'Consolidated actual totex inp'!$C17)*'Consolidated actual totex inp'!J$3","v":0},{"$f":"SUMIFS(F_Inputs!J:J, F_Inputs!$A:$A, 'Consolidated actual totex inp'!$E$1, F_Inputs!$B:$B, 'Consolidated actual totex inp'!$C17)*'Consolidated actual totex inp'!K$3","v":0}]
[null,"B0427TGTE_SW","B0427TGTE_SW_PR24",null,null,"Green recovery programme - Total green recovery programme expenditure - Totex - Raw water storage - Water network+ - Expenditure in report year",{"$f":"SUMIFS('F_Inputs-APR & PR19'!F:F, 'F_Inputs-APR & PR19'!$A:$A, 'Consolidated actual totex inp'!$E$1, 'F_Inputs-APR & PR19'!$B:$B, 'Consolidated actual totex inp'!$B18)","v":0},{"$f":"SUMIFS('F_Inputs-APR & PR19'!G:G, 'F_Inputs-APR & PR19'!$A:$A, 'Consolidated actual totex inp'!$E$1, 'F_Inputs-APR & PR19'!$B:$B, 'Consolidated actual totex inp'!$B18)","v":0},{"$f":"SUMIFS(F_Inputs!H:H, F_Inputs!$A:$A, 'Consolidated actual totex inp'!$E$1, F_Inputs!$B:$B, 'Consolidated actual totex inp'!$C18)*'Consolidated actual totex inp'!I$3","v":0},{"$f":"SUMIFS(F_Inputs!I:I, F_Inputs!$A:$A, 'Consolidated actual totex inp'!$E$1, F_Inputs!$B:$B, 'Consolidated actual totex inp'!$C18)*'Consolidated actual totex inp'!J$3","v":0},{"$f":"SUMIFS(F_Inputs!J:J, F_Inputs!$A:$A, 'Consolidated actual totex inp'!$E$1, F_Inputs!$B:$B, 'Consolidated actual totex inp'!$C18)*'Consolidated actual totex inp'!K$3","v":0}]
[null,"B0434TGTE_TW","B0434TGTE_TW_PR24",null,null,"Green recovery programme - Total green recovery programme expenditure - Totex - Water treatment - Water network+ - Expenditure in report year",{"$f":"SUMIFS('F_Inputs-APR & PR19'!F:F, 'F_Inputs-APR & PR19'!$A:$A, 'Consolidated actual totex inp'!$E$1, 'F_Inputs-APR & PR19'!$B:$B, 'Consolidated actual totex inp'!$B19)","v":0},{"$f":"SUMIFS('F_Inputs-APR & PR19'!G:G, 'F_Inputs-APR & PR19'!$A:$A, 'Consolidated actual totex inp'!$E$1, 'F_Inputs-APR & PR19'!$B:$B, 'Consolidated actual totex inp'!$B19)","v":0},{"$f":"SUMIFS(F_Inputs!H:H, F_Inputs!$A:$A, 'Consolidated actual totex inp'!$E$1, F_Inputs!$B:$B, 'Consolidated actual totex inp'!$C19)*'Consolidated actual totex inp'!I$3","v":0},{"$f":"SUMIFS(F_Inputs!I:I, F_Inputs!$A:$A, 'Consolidated actual totex inp'!$E$1, F_Inputs!$B:$B, 'Consolidated actual totex inp'!$C19)*'Consolidated actual totex inp'!J$3","v":0},{"$f":"SUMIFS(F_Inputs!J:J, F_Inputs!$A:$A, 'Consolidated actual totex inp'!$E$1, F_Inputs!$B:$B, 'Consolidated actual totex inp'!$C19)*'Consolidated actual totex inp'!K$3","v":0}]
[null,"B0441TGTE_DW","B0441TGTE_DW_PR24",null,null,"Green recovery programme - Total green recovery programme expenditure - Totex - Treated water distribution - Water network+ - Expenditure in report year",{"$f":"SUMIFS('F_Inputs-APR & PR19'!F:F, 'F_Inputs-APR & PR19'!$A:$A, 'Consolidated actual totex inp'!$E$1, 'F_Inputs-APR & PR19'!$B:$B, 'Consolidated actual totex inp'!$B20)","v":0},{"$f":"SUMIFS('F_Inputs-APR & PR19'!G:G, 'F_Inputs-APR & PR19'!$A:$A, 'Consolidated actual totex inp'!$E$1, 'F_Inputs-APR & PR19'!$B:$B, 'Consolidated actual totex inp'!$B20)","v":0},{"$f":"SUMIFS(F_Inputs!H:H, F_Inputs!$A:$A, 'Consolidated actual totex inp'!$E$1, F_Inputs!$B:$B, 'Consolidated actual totex inp'!$C20)*'Consolidated actual totex inp'!I$3","v":0},{"$f":"SUMIFS(F_Inputs!I:I, F_Inputs!$A:$A, 'Consolidated actual totex inp'!$E$1, F_Inputs!$B:$B, 'Consolidated actual totex inp'!$C20)*'Consolidated actual totex inp'!J$3","v":0},{"$f":"SUMIFS(F_Inputs!J:J, F_Inputs!$A:$A, 'Consolidated actual totex inp'!$E$1, F_Inputs!$B:$B, 'Consolidated actual totex inp'!$C20)*'Consolidated actual totex inp'!K$3","v":0}]
[null,"B0513TGTE_FOW","B0513TGTE_FOW_PR24",null,null,"Green recovery programme - Total green recovery programme expenditure - Totex - Foul - Wastewater network+  - Expenditure in report year",{"$f":"SUMIFS('F_Inputs-APR & PR19'!F:F, 'F_Inputs-APR & PR19'!$A:$A, 'Consolidated actual totex inp'!$E$1, 'F_Inputs-APR & PR19'!$B:$B, 'Consolidated actual totex inp'!$B21)","v":0},{"$f":"SUMIFS('F_Inputs-APR & PR19'!G:G, 'F_Inputs-APR & PR19'!$A:$A, 'Consolidated actual totex inp'!$E$1, 'F_Inputs-APR & PR19'!$B:$B, 'Consolidated actual totex inp'!$B21)","v":0},{"$f":"SUMIFS(F_Inputs!H:H, F_Inputs!$A:$A, 'Consolidated actual totex inp'!$E$1, F_Inputs!$B:$B, 'Consolidated actual totex inp'!$C21)*'Consolidated actual totex inp'!I$3","v":0},{"$f":"SUMIFS(F_Inputs!I:I, F_Inputs!$A:$A, 'Consolidated actual totex inp'!$E$1, F_Inputs!$B:$B, 'Consolidated actual totex inp'!$C21)*'Consolidated actual totex inp'!J$3","v":0},{"$f":"SUMIFS(F_Inputs!J:J, F_Inputs!$A:$A, 'Consolidated actual totex inp'!$E$1, F_Inputs!$B:$B, 'Consolidated actual totex inp'!$C21)*'Consolidated actual totex inp'!K$3","v":0}]
[null,"B0520TGTE_SUW","B0520TGTE_SUW_PR24",null,null,"Green recovery programme - Total green recovery programme expenditure - Totex - Surface water drainage - Wastewater network+  - Expenditure in report year",{"$f":"SUMIFS('F_Inputs-APR & PR19'!F:F, 'F_Inputs-APR & PR19'!$A:$A, 'Consolidated actual totex inp'!$E$1, 'F_Inputs-APR & PR19'!$B:$B, 'Consolidated actual totex inp'!$B22)","v":0},{"$f":"SUMIFS('F_Inputs-APR & PR19'!G:G, 'F_Inputs-APR & PR19'!$A:$A, 'Consolidated actual totex inp'!$E$1, 'F_Inputs-APR & PR19'!$B:$B, 'Consolidated actual totex inp'!$B22)","v":0},{"$f":"SUMIFS(F_Inputs!H:H, F_Inputs!$A:$A, 'Consolidated actual totex inp'!$E$1, F_Inputs!$B:$B, 'Consolidated actual totex inp'!$C22)*'Consolidated actual totex inp'!I$3","v":0},{"$f":"SUMIFS(F_Inputs!I:I, F_Inputs!$A:$A, 'Consolidated actual totex inp'!$E$1, F_Inputs!$B:$B, 'Consolidated actual totex inp'!$C22)*'Consolidated actual totex inp'!J$3","v":0},{"$f":"SUMIFS(F_Inputs!J:J, F_Inputs!$A:$A, 'Consolidated actual totex inp'!$E$1, F_Inputs!$B:$B, 'Consolidated actual totex inp'!$C22)*'Consolidated actual totex inp'!K$3","v":0}]
[null,"B0527TGTE_HDW","B0527TGTE_HDW_PR24",null,null,"Green recovery programme - Total green recovery programme expenditure - Totex - Highway drainage - Wastewater network+  - Expenditure in report year",{"$f":"SUMIFS('F_Inputs-APR & PR19'!F:F, 'F_Inputs-APR & PR19'!$A:$A, 'Consolidated actual totex inp'!$E$1, 'F_Inputs-APR & PR19'!$B:$B, 'Consolidated actual totex inp'!$B23)","v":0},{"$f":"SUMIFS('F_Inputs-APR & PR19'!G:G, 'F_Inputs-APR & PR19'!$A:$A, 'Consolidated actual totex inp'!$E$1, 'F_Inputs-APR & PR19'!$B:$B, 'Consolidated actual totex inp'!$B23)","v":0},{"$f":"SUMIFS(F_Inputs!H:H, F_Inputs!$A:$A, 'Consolidated actual totex inp'!$E$1, F_Inputs!$B:$B, 'Consolidated actual totex inp'!$C23)*'Consolidated actual totex inp'!I$3","v":0},{"$f":"SUMIFS(F_Inputs!I:I, F_Inputs!$A:$A, 'Consolidated actual totex inp'!$E$1, F_Inputs!$B:$B, 'Consolidated actual totex inp'!$C23)*'Consolidated actual totex inp'!J$3","v":0},{"$f":"SUMIFS(F_Inputs!J:J, F_Inputs!$A:$A, 'Consolidated actual totex inp'!$E$1, F_Inputs!$B:$B, 'Consolidated actual totex inp'!$C23)*'Consolidated actual totex inp'!K$3","v":0}]
[null,"B0534TGTE_STW","B0534TGTE_STW_PR24",null,null,"Green recovery programme - Total green recovery programme expenditure - Totex - Sewage treatment and disposal - Wastewater network+  - Expenditure in report year",{"$f":"SUMIFS('F_Inputs-APR & PR19'!F:F, 'F_Inputs-APR & PR19'!$A:$A, 'Consolidated actual totex inp'!$E$1, 'F_Inputs-APR & PR19'!$B:$B, 'Consolidated actual totex inp'!$B24)","v":0},{"$f":"SUMIFS('F_Inputs-APR & PR19'!G:G, 'F_Inputs-APR & PR19'!$A:$A, 'Consolidated actual totex inp'!$E$1, 'F_Inputs-APR & PR19'!$B:$B, 'Consolidated actual totex inp'!$B24)","v":0},{"$f":"SUMIFS(F_Inputs!H:H, F_Inputs!$A:$A, 'Consolidated actual totex inp'!$E$1, F_Inputs!$B:$B, 'Consolidated actual totex inp'!$C24)*'Consolidated actual totex inp'!I$3","v":0},{"$f":"SUMIFS(F_Inputs!I:I, F_Inputs!$A:$A, 'Consolidated actual totex inp'!$E$1, F_Inputs!$B:$B, 'Consolidated actual totex inp'!$C24)*'Consolidated actual totex inp'!J$3","v":0},{"$f":"SUMIFS(F_Inputs!J:J, F_Inputs!$A:$A, 'Consolidated actual totex inp'!$E$1, F_Inputs!$B:$B, 'Consolidated actual totex inp'!$C24)*'Consolidated actual totex inp'!K$3","v":0}]
[null,"B0541TGTE_SLW","B0541TGTE_SLW_PR24",null,null,"Green recovery programme - Total green recovery programme expenditure - Totex - Sludge liquor treatment - Wastewater network+  - Expenditure in report year",{"$f":"SUMIFS('F_Inputs-APR & PR19'!F:F, 'F_Inputs-APR & PR19'!$A:$A, 'Consolidated actual totex inp'!$E$1, 'F_Inputs-APR & PR19'!$B:$B, 'Consolidated actual totex inp'!$B25)","v":0},{"$f":"SUMIFS('F_Inputs-APR & PR19'!G:G, 'F_Inputs-APR & PR19'!$A:$A, 'Consolidated actual totex inp'!$E$1, 'F_Inputs-APR & PR19'!$B:$B, 'Consolidated actual totex inp'!$B25)","v":0},{"$f":"SUMIFS(F_Inputs!H:H, F_Inputs!$A:$A, 'Consolidated actual totex inp'!$E$1, F_Inputs!$B:$B, 'Consolidated actual totex inp'!$C25)*'Consolidated actual totex inp'!I$3","v":0},{"$f":"SUMIFS(F_Inputs!I:I, F_Inputs!$A:$A, 'Consolidated actual totex inp'!$E$1, F_Inputs!$B:$B, 'Consolidated actual totex inp'!$C25)*'Consolidated actual totex inp'!J$3","v":0},{"$f":"SUMIFS(F_Inputs!J:J, F_Inputs!$A:$A, 'Consolidated actual totex inp'!$E$1, F_Inputs!$B:$B, 'Consolidated actual totex inp'!$C25)*'Consolidated actual totex inp'!K$3","v":0}]
[null,null,"PD9_12WR_PR24",null,null,"CMA companies only – items excluded from general cost sharing with bespoke sharing rates - Actual totex – items with bespoke sharing rates - Water resources",null,null,{"$f":"SUMIF(F_Inputs!$B:$B, 'Consolidated actual totex inp'!$C26, F_Inputs!H:H)*'Consolidated actual totex inp'!I$3","v":0},{"$f":"SUMIF(F_Inputs!$B:$B, 'Consolidated actual totex inp'!$C26, F_Inputs!I:I)*'Consolidated actual totex inp'!J$3","v":0},{"$f":"SUMIF(F_Inputs!$B:$B, 'Consolidated actual totex inp'!$C26, F_Inputs!J:J)*'Consolidated actual totex inp'!K$3","v":0}]
[null,null,"PD9_12WNP_PR24",null,null,"CMA companies only – items excluded from general cost sharing with bespoke sharing rates - Actual totex – items with bespoke sharing rates - Water network plus",null,null,{"$f":"SUMIF(F_Inputs!$B:$B, 'Consolidated actual totex inp'!$C27, F_Inputs!H:H)*'Consolidated actual totex inp'!I$3","v":0},{"$f":"SUMIF(F_Inputs!$B:$B, 'Consolidated actual totex inp'!$C27, F_Inputs!I:I)*'Consolidated actual totex inp'!J$3","v":0},{"$f":"SUMIF(F_Inputs!$B:$B, 'Consolidated actual totex inp'!$C27, F_Inputs!J:J)*'Consolidated actual totex inp'!K$3","v":0}]
[null,null,"PD9_12WWNP_PR24",null,null,"CMA companies only – items excluded from general cost sharing with bespoke sharing rates - Actual totex – items with bespoke sharing rates - Wastewater network plus",null,null,{"$f":"SUMIF(F_Inputs!$B:$B, 'Consolidated actual totex inp'!$C28, F_Inputs!H:H)*'Consolidated actual totex inp'!I$3","v":0},{"$f":"SUMIF(F_Inputs!$B:$B, 'Consolidated actual totex inp'!$C28, F_Inputs!I:I)*'Consolidated actual totex inp'!J$3","v":0},{"$f":"SUMIF(F_Inputs!$B:$B, 'Consolidated actual totex inp'!$C28, F_Inputs!J:J)*'Consolidated actual totex inp'!K$3","v":0}]
[null,null,"PD9_12BIO_PR24",null,null,"CMA companies only – items excluded from general cost sharing with bespoke sharing rates - Actual totex – items with bespoke sharing rates - Bioresources",null,null,{"$f":"SUMIF(F_Inputs!$B:$B, 'Consolidated actual totex inp'!$C29, F_Inputs!H:H)*'Consolidated actual totex inp'!I$3","v":0},{"$f":"SUMIF(F_Inputs!$B:$B, 'Consolidated actual totex inp'!$C29, F_Inputs!I:I)*'Consolidated actual totex inp'!J$3","v":0},{"$f":"SUMIF(F_Inputs!$B:$B, 'Consolidated actual totex inp'!$C29, F_Inputs!J:J)*'Consolidated actual totex inp'!K$3","v":0}]
[]
[null,null,null,"Data override"]
[null,null,null,null,null,"Totex (net of business rates, abstraction licence fees and grants and contributions) - Total actual totex  (net of business rates, abstraction licence fees and grants and contributions) - Water resources"]
[null,null,null,null,null,"Totex (net of business rates, abstraction licence fees and grants and contributions) - Total actual totex  (net of business rates, abstraction licence fees and grants and contributions) - Water network plus"]
[null,null,null,null,null,"Totex (net of business rates, abstraction licence fees and grants and contributions) - Total actual totex  (net of business rates, abstraction licence fees and grants and contributions) - Wastewater network plus"]
[null,null,null,null,null,"Totex (net of business rates, abstraction licence fees and grants and contributions) - Total actual totex  (net of business rates, abstraction licence fees and grants and contributions) - Additional Control"]
[null,null,null,null,null,"Totex - business rates and abstraction licence fees - Actual totex - business rates - Water resources"]
[null,null,null,null,null,"Totex - business rates and abstraction licence fees - Actual totex - business rates - Water network plus"]
[null,null,null,null,null,"Totex - business rates and abstraction licence fees - Actual totex - business rates - Wastewater network plus"]
[null,null,null,null,null,"Totex - business rates and abstraction licence fees - Actual totex - business rates - Bioresources"]
[null,null,null,null,null,"Totex - business rates and abstraction licence fees - Actual totex - business rates - Additional Control"]
[null,null,null,null,null,"Totex - business rates and abstraction licence fees - Actual totex - abstraction licence fees - Water resources"]
[null,null,null,null,null,"Totex - business rates and abstraction licence fees - Actual totex - abstraction licence fees - Water network plus"]
[null,null,null,null,null,"Green recovery programme - Total green recovery programme expenditure - Totex - Water resources - Expenditure in report year"]
[null,null,null,null,null,"Green recovery programme - Total green recovery programme expenditure - Totex - Raw water transport - Water network+ - Expenditure in report year"]
[null,null,null,null,null,"Green recovery programme - Total green recovery programme expenditure - Totex - Raw water storage - Water network+ - Expenditure in report year"]
[null,null,null,null,null,"Green recovery programme - Total green recovery programme expenditure - Totex - Water treatment - Water network+ - Expenditure in report year"]
[null,null,null,null,null,"Green recovery programme - Total green recovery programme expenditure - Totex - Treated water distribution - Water network+ - Expenditure in report year"]
[null,null,null,null,null,"Green recovery programme - Total green recovery programme expenditure - Totex - Foul - Wastewater network+  - Expenditure in report year"]
[null,null,null,null,null,"Green recovery programme - Total green recovery programme expenditure - Totex - Surface water drainage - Wastewater network+  - Expenditure in report year"]
[null,null,null,null,null,"Green recovery programme - Total green recovery programme expenditure - Totex - Highway drainage - Wastewater network+  - Expenditure in report year"]
[null,null,null,null,null,"Green recovery programme - Total green recovery programme expenditure - Totex - Sewage treatment and disposal - Wastewater network+  - Expenditure in report year"]
[null,null,null,null,null,"Green recovery programme - Total green recovery programme expenditure - Totex - Sludge liquor treatment - Wastewater network+  - Expenditure in report year"]
[null,null,null,null,null,"CMA companies only – items excluded from general cost sharing with bespoke sharing rates - Actual totex – items with bespoke sharing rates - Water resources"]
[null,null,null,null,null,"CMA companies only – items excluded from general cost sharing with bespoke sharing rates - Actual totex – items with bespoke sharing rates - Water network plus"]
[null,null,null,null,null,"CMA companies only – items excluded from general cost sharing with bespoke sharing rates - Actual totex – items with bespoke sharing rates - Wastewater network plus"]
[null,null,null,null,null,"CMA companies only – items excluded from general cost sharing with bespoke sharing rates - Actual totex – items with bespoke sharing rates - Bioresources"]
[]
[null,null,null,"Data after override"]
[null,null,null,null,null,"Totex (net of business rates, abstraction licence fees and grants and contributions) - Total actual totex  (net of business rates, abstraction licence fees and grants and contributions) - Water resources",{"$f":"IF(ISBLANK(G32),G5,G32)","v":9.2840000000000007},{"$f":"IF(ISBLANK(H32),H5,H32)","v":10.571},13.416,18.680688166948869,15.865326151546483,"Net totex for cost sharing reconciliation - WR - Nominal"]
[null,null,null,null,null,"Totex (net of business rates, abstraction licence fees and grants and contributions) - Total actual totex  (net of business rates, abstraction licence fees and grants and contributions) - Water network plus",{"$f":"IF(ISBLANK(G33),G6,G33)","v":119.90600000000001},118.23,131.114,141.29166453211425,118.79749787637178,"Net totex for cost sharing reconciliation - WN  - Nominal"]
[null,null,null,null,null,"Totex (net of business rates, abstraction licence fees and grants and contributions) - Total actual totex  (net of business rates, abstraction licence fees and grants and contributions) - Wastewater network plus",{"$f":"IF(ISBLANK(G34),G7,G34)","v":237.078},235.87299999999999,262.85399999999998,348.29182785957795,342.09928002590084,"Net totex for cost sharing reconciliation - WWN - nominal"]
[null,null,null,null,null,"Totex (net of business rates, abstraction licence fees and grants and contributions) - Total actual totex  (net of business rates, abstraction licence fees and grants and contributions) - Additional Control",{"$f":"IF(ISBLANK(G35),G8,G35)","v":0},0,0,0,0,"Net totex for cost sharing reconciliation - TTT - nominal"]
[null,null,null,null,null,"Totex - business rates and abstraction licence fees - Actual totex - business rates - Water resources",{"$f":"IF(ISBLANK(G36),G9,G36)","v":0.96764071120538497},0.96138774503593805,0.97399999999999998,0.70503134766903741,0.69606638346838268,"Business rates - Actual - WR - Nominal"]
[null,null,null,null,null,"Totex - business rates and abstraction licence fees - Actual totex - business rates - Water network plus",{"$f":"IF(ISBLANK(G37),G10,G37)","v":15.0517525785476},14.929807562819301,14.994,10.842895898634159,10.702291699714026,"Business rates - Actual - WN - Nominal"]
[null,null,null,null,null,"Totex - business rates and abstraction licence fees - Actual totex - business rates - Wastewater network plus",{"$f":"IF(ISBLANK(G38),G11,G38)","v":7.1502332510739697},7.1476199182773197,7.1479999999999997,9.5068244991534048,9.3828013746657053,"Business rates - Actual - WWN - Nominal"]
[null,null,null,null,null,"Totex - business rates and abstraction licence fees - Actual totex - business rates - Bioresources",{"$f":"IF(ISBLANK(G39),G12,G39)","v":1.64603258293165},1.61860586852216,1.6140000000000001,1.9871948030251725,1.9613459309880126,"Business rates - Actual - BIO - Nominal"]
[null,null,null,null,null,"Totex - business rates and abstraction licence fees - Actual totex - business rates - Additional Control",{"$f":"IF(ISBLANK(G40),G13,G40)","v":0},0,0,0,0]
[null,null,null,null,null,"Totex - business rates and abstraction licence fees - Actual totex - abstraction licence fees - Water resources",{"$f":"IF(ISBLANK(G41),G14,G41)","v":2.47946263753408},2.5835450156070401,2.7320000000000002,2.8740333348007683,2.8742554245711562,"Abstraction charges - Actual - WR - Nominal"]
[null,null,null,null,null,"Totex - business rates and abstraction licence fees - Actual totex - abstraction licence fees - Water network plus",{"$f":"IF(ISBLANK(G42),G15,G42)","v":0.142499230322811},0.14298974377236701,0.152,0.15115364725138281,0.15179017708033268,"Abstraction charges - Actual - WN - Nominal"]
[null,null,null,null,null,"Green recovery programme - Total green recovery programme expenditure - Totex - Water resources - Expenditure in report year",{"$f":"IF(ISBLANK(G43),G16,G43)","v":0},0,0,0,0,"Actual Green Recovery Expenditure - WR - nominal"]
[null,null,null,null,null,"Green recovery programme - Total green recovery programme expenditure - Totex - Raw water transport - Water network+ - Expenditure in report year",{"$f":"IF(ISBLANK(G44),G17,G44)","v":0},0,0,0,0,"Actual Green Recovery Expenditure - WN - nominal"]
[null,null,null,null,null,"Green recovery programme - Total green recovery programme expenditure - Totex - Raw water storage - Water network+ - Expenditure in report year",{"$f":"IF(ISBLANK(G45),G18,G45)","v":0},0,0,0,0,"Actual Green Recovery Expenditure - WN - nominal"]
[null,null,null,null,null,"Green recovery programme - Total green recovery programme expenditure - Totex - Water treatment - Water network+ - Expenditure in report year",{"$f":"IF(ISBLANK(G46),G19,G46)","v":0},0,0,0,0,"Actual Green Recovery Expenditure - WN - nominal"]
[null,null,null,null,null,"Green recovery programme - Total green recovery programme expenditure - Totex - Treated water distribution - Water network+ - Expenditure in report year",{"$f":"IF(ISBLANK(G47),G20,G47)","v":0},0,0,0,0,"Actual Green Recovery Expenditure - WN - nominal"]
[null,null,null,null,null,"Green recovery programme - Total green recovery programme expenditure - Totex - Foul - Wastewater network+  - Expenditure in report year",{"$f":"IF(ISBLANK(G48),G21,G48)","v":0},0,0,0,0,"Actual Green Recovery Expenditure - WWN - nominal"]
[null,null,null,null,null,"Green recovery programme - Total green recovery programme expenditure - Totex - Surface water drainage - Wastewater network+  - Expenditure in report year",{"$f":"IF(ISBLANK(G49),G22,G49)","v":0},0,0,0,0,"Actual Green Recovery Expenditure - WWN - nominal"]
[null,null,null,null,null,"Green recovery programme - Total green recovery programme expenditure - Totex - Highway drainage - Wastewater network+  - Expenditure in report year",{"$f":"IF(ISBLANK(G50),G23,G50)","v":0},0,0,0,0,"Actual Green Recovery Expenditure - WWN - nominal"]
[null,null,null,null,null,"Green recovery programme - Total green recovery programme expenditure - Totex - Sewage treatment and disposal - Wastewater network+  - Expenditure in report year",{"$f":"IF(ISBLANK(G51),G24,G51)","v":0},0,0,0,0,"Actual Green Recovery Expenditure - WWN - nominal"]
[null,null,null,null,null,"Green recovery programme - Total green recovery programme expenditure - Totex - Sludge liquor treatment - Wastewater network+  - Expenditure in report year",{"$f":"IF(ISBLANK(G52),G25,G52)","v":0},0,0,0,0,"Actual Green Recovery Expenditure - WWN - nominal"]
[null,null,null,null,null,"CMA companies only – items excluded from general cost sharing with bespoke sharing rates - Actual totex – items with bespoke sharing rates - Water resources",{"$f":"IF(ISBLANK(G53),G26,G53)","v":0},0,0,0,0,"Actuals for CMA excluded items - WR - nominal"]
[null,null,null,null,null,"CMA companies only – items excluded from general cost sharing with bespoke sharing rates - Actual totex – items with bespoke sharing rates - Water network plus",{"$f":"IF(ISBLANK(G54),G27,G54)","v":0},0,0,0,0,"Actuals for CMA excluded items - WN - nominal"]
[null,null,null,null,null,"CMA companies only – items excluded from general cost sharing with bespoke sharing rates - Actual totex – items with bespoke sharing rates - Wastewater network plus",{"$f":"IF(ISBLANK(G55),G28,G55)","v":0},0,0,0,0,"Actuals for CMA excluded items - WWN - nominal"]
[null,null,null,null,null,"CMA companies only – items excluded from general cost sharing with bespoke sharing rates - Actual totex – items with bespoke sharing rates - Bioresources",{"$f":"IF(ISBLANK(G56),G29,G56)","v":0},0,0,0,0,"Actuals for CMA excluded items - BIO - nominal"]

{"sheet":"Non-fountain inputs","index":8,"n_rows":261,"n_cols":9,"rows_kept":261,"cut":false,"hidden":false,"merged":[]}
[{"$f":" RIGHT(CELL(\"filename\", $A$1), LEN(CELL(\"filename\", $A$1)) - SEARCH(\"]\", CELL(\"filename\", $A$1)))","v":{"$error":"#VALUE!"}}]
["ASHE - Mean hourly pay, all manufacturing £/h nominal","Earnings and hours worked, industry by two-digit SIC: ASHE Table 4 - Office for National Statistics (ons.gov.uk)"]
[null,"2019-20","2020-21","2021-22","22-23"]
[null,17.059999999999999,17.54,18.14,19.600000000000001]
[null,"Final","Final","Final","Provisional"]
[]
["Allowance for CMA excluded items - 2017-18 prices",null,"2020-21","2021-22","2022-23","2023-24","2024-25"]
["ANH","Allowance for CMA excluded items - WR - real",0,0,0,0,0]
["ANH","Allowance for CMA excluded items - WN - real",0,0,0,0,0]
["ANH","Allowance for CMA excluded items - WWN - real",0,0,0,0,0]
["ANH","Allowance for CMA excluded items - BIO - real",0,0,0,0,0]
["NES","Allowance for CMA excluded items - WR - real",0,0,0,0,0]
["NES","Allowance for CMA excluded items - WN - real",0,0,0,0,0]
["NES","Allowance for CMA excluded items - WWN - real",0,0,0,0,0]
["NES","Allowance for CMA excluded items - BIO - real",2.4,2.4,2.4,2.4,2.4]
["YKY","Allowance for CMA excluded items - WR - real",0,0,0,0,0]
["YKY","Allowance for CMA excluded items - WN - real",0,0,0,0,0]
["YKY","Allowance for CMA excluded items - WWN - real",0,0,0,0,0]
["YKY","Allowance for CMA excluded items - BIO - real",0,0,0,0,0]
["BRL","Allowance for CMA excluded items - WR - real",0,0,0,0,0,"BRL incl CMA redetermination costs as excluded but since these were included in the"]
["BRL","Allowance for CMA excluded items - WN - real",0,0,0,0,0,"CMA's redetermination allowance there is no reconciliation required."]
["BRL","Allowance for CMA excluded items - WWN - real",0,0,0,0,0]
["BRL","Allowance for CMA excluded items - BIO - real",0,0,0,0,0]
[]
["Bespoke cost sharing rates"]
[null,"PR19","CMA"]
["Cost sharing rates Business rates - Overperformance",0.25,0.1]
["Cost sharing rates Business rates - Underperformance",0.25,0.1]
["Cost sharing rates Abstraction - Overperformance",0.25,0.25]
["Cost sharing rates Abstraction - Underperformance",0.25,0.25]
["Green Recovery Outperformance Rate ",0.1]
["Green Recovery Underperformance Rate ",0.5]
[]
["Weighted average PAYG rates, %","From chapter 4 of companies' PR19 FD or as revised by the CMA"]
[null,"WR","WN+","WWN+","BIO","TTT"]
["ANH",0.79578953045792988,0.51935035830679399,0.41860129205385699,0.82809424361187745]
["WSH",0.57399999999999995,0.55100000000000005,0.55400000000000005,0.629]
["HDD",0.70499999999999996,0.71299999999999997,0.47199999999999998,1]
["NES",0.91380504991342204,0.5638708227115008,0.37475860990530002,0.40713992392162446]
["SVE",0.71,0.61199999999999999,0.56799999999999995,0.38800000000000001]
["SWB",0.78300000000000003,0.58799999999999997,0.51900000000000002,0.75700000000000001]
["SRN",0.52800000000000002,0.48199999999999998,0.41299999999999998,0.52200000000000002]
["TMS",0.54800000000000004,0.438,0.47299999999999998,0.38500000000000001]
["NWT",0.76200000000000001,0.71599999999999997,0.47299999999999998,0.54200000000000004]
["WSX",0.64100000000000001,0.72199999999999998,0.40300000000000002,0.73]
["YKY",0.82129606634945274,0.7554718579554881,0.45423616865049421,0.58212581872626012]
["AFW",0.36399999999999999,0.61499999999999999]
["BRL",0.78976583539096212,0.73936502684854033]
["PRT",0.81799999999999995,0.68799999999999994]
["SEW",0.59099999999999997,0.67100000000000004]
["SSC",0.63800000000000001,0.63500000000000001]
["SES",0.81499999999999995,0.49]
[]
["Wholesale WACC (Real CPIH)"]
["ANH",3.1199999999999999E-2]
["NES",3.1199999999999999E-2]
["YKY",3.1199999999999999E-2]
["BRL",3.2899999999999999E-2]
["PRT",3.1099999999999999E-2]
["SSC",3.1099999999999999E-2]
["HDD",2.92E-2]
["SRN",2.92E-2]
["SVE",2.92E-2]
["SWB",2.92E-2]
["TMS",2.92E-2]
["UUW",2.92E-2]
["WSH",2.92E-2]
["WSX",2.92E-2]
["AFW",2.92E-2]
["SES",2.92E-2]
["SEW",2.92E-2]
[]
["Financial flows dataset","https://www.ofwat.gov.uk/wp-content/uploads/2023/05/Financial-Flows-Data-Source-new-2022-23v8.xlsx"]
[null,null,null,"2020-21","2021-22","2022-23","2023-24","2024-25","2020-25"]
["AFW","Totex WR  - Allowed totex net of Grants & contributions, abstraction charges & business rates","£m",33.536569908870476,41.642287503524216,39.318008382417261,44.105033859632925,27.915079089720486,{"$f":"SUM(D75:H75)","v":186.51697874416536}]
["AFW","Totex WN  - Allowed totex net of Grants & contributions, abstraction charges & business rates","£m",206.89031525969611,204.19197098401631,197.80315786649106,181.44627394729679,176.75462585466309,{"$f":"SUM(D76:H76)","v":967.08634391216333}]
["AFW","Totex WWN  - Allowed totex net of Grants & contributions, abstraction charges & business rates","£m",0,0,0,0,0,0]
["AFW","Totex BR  - Allowed totex net of Grants & contributions, abstraction charges & business rates","£m",0,0,0,0,0,0]
["AFW","Totex DMMY  - Allowed totex net of Grants & contributions, abstraction charges & business rates","£m",0,0,0,0,0,0]
["AFW","WR opex for cost sharing",null,5.1652024499003239E-2,5.45452642212459E-2,5.5460599982874649E-2,5.3050992178817188E-2,4.3835553230213563E-2]
["AFW","WR Capex for cost sharing",null,0.12815235649984763,0.16871745311368666,0.1553406291982366,0.18341559738635729,0.10582952968971727]
["AFW","WN opex for cost sharing",null,0.10303981696341735,0.10127461447612791,9.9498612985827281E-2,0.10513787178429797,0.10303222780682761]
["AFW","WN Capex for cost sharing",null,0.11089176894106433,0.1098667921515333,0.10503654471923979,8.2483714529588387E-2,7.9738035642075974E-2]
["AFW","WWN opex for cost sharing",null,{"$error":"#DIV/0!"},{"$error":"#DIV/0!"},{"$error":"#DIV/0!"},{"$error":"#DIV/0!"},{"$error":"#DIV/0!"}]
["AFW","WWN Capex for cost sharing",null,{"$error":"#DIV/0!"},{"$error":"#DIV/0!"},{"$error":"#DIV/0!"},{"$error":"#DIV/0!"},{"$error":"#DIV/0!"}]
["BRL","Totex WR  - Allowed totex net of Grants & contributions, abstraction charges & business rates","£m",12.138634630545079,11.81203840168827,15.217490712505542,11.567988031355116,11.527747256384506,62.263899032478513]
["BRL","Totex WN  - Allowed totex net of Grants & contributions, abstraction charges & business rates","£m",62.613217354508379,61.172275978471816,57.970795276243386,60.342661324699634,60.578193002714912,302.67714293663812]
["BRL","Totex WWN  - Allowed totex net of Grants & contributions, abstraction charges & business rates","£m",0,0,0,0,0,0]
["BRL","Totex BR  - Allowed totex net of Grants & contributions, abstraction charges & business rates","£m",0,0,0,0,0,0]
["BRL","Totex DMMY  - Allowed totex net of Grants & contributions, abstraction charges & business rates","£m",0,0,0,0,0,0]
["BRL","WR opex for cost sharing",null,0.13300323876106965,0.13230034676031838,0.13208975191005215,0.13196410066490988,0.13216054299001459]
["BRL","WR Capex for cost sharing",null,6.1951378909327892E-2,5.7408916315654382E-2,0.11231336047081074,5.3825549696063298E-2,5.2982813521779311E-2]
["BRL","WN opex for cost sharing",null,0.11798927162010849,0.11636571473497882,0.11578771668953923,0.11525541963655696,0.11530569527991816]
["BRL","WN Capex for cost sharing",null,8.8875431631090476E-2,8.5738333773492506E-2,7.5739118517765755E-2,8.4107706165551119E-2,8.4835591950998532E-2]
["BRL","WWN opex for cost sharing",null,{"$error":"#DIV/0!"},{"$error":"#DIV/0!"},{"$error":"#DIV/0!"},{"$error":"#DIV/0!"},{"$error":"#DIV/0!"}]
["BRL","WWN Capex for cost sharing",null,{"$error":"#DIV/0!"},{"$error":"#DIV/0!"},{"$error":"#DIV/0!"},{"$error":"#DIV/0!"},{"$error":"#DIV/0!"}]
["PRT","Totex WR  - Allowed totex net of Grants & contributions, abstraction charges & business rates","£m",5.8272199853323636,4.1031518191424281,3.7783368541177049,5.2704452458370881,4.9555777836976098,23.934731688127194]
["PRT","Totex WN  - Allowed totex net of Grants & contributions, abstraction charges & business rates","£m",27.265192571700435,27.613163802594023,28.049249093875179,26.899966183215959,26.894466839719147,136.72203849110474]
["PRT","Totex WWN  - Allowed totex net of Grants & contributions, abstraction charges & business rates","£m",0,0,0,0,0,0]
["PRT","Totex BR  - Allowed totex net of Grants & contributions, abstraction charges & business rates","£m",0,0,0,0,0,0]
["PRT","Totex DMMY  - Allowed totex net of Grants & contributions, abstraction charges & business rates","£m",10.106223006752948,6.1053286704016836,7.0996169139715324,17.650278218709857,20.465054105950578,61.426500915786598]
["PRT","WR opex for cost sharing",null,0.14476975910601966,0.14893345241232192,0.15033205818968084,0.14715972043249817,0.14250034935163608]
["PRT","WR Capex for cost sharing",null,9.869317422708937E-2,2.2497415190751855E-2,7.5279463990460009E-3,7.3041003541002181E-2,6.4545121149953893E-2]
["PRT","WN opex for cost sharing",null,0.12713185482280057,0.12825383178960081,0.12806085581219231,0.12712499962290486,0.12591435538439005]
["PRT","WN Capex for cost sharing",null,7.2288757044936716E-2,7.371187986405156E-2,7.709443153894005E-2,6.9624306341883602E-2,7.0794727778299357E-2]
["PRT","WWN opex for cost sharing",null,{"$error":"#DIV/0!"},{"$error":"#DIV/0!"},{"$error":"#DIV/0!"},{"$error":"#DIV/0!"},{"$error":"#DIV/0!"}]
["PRT","WWN Capex for cost sharing",null,{"$error":"#DIV/0!"},{"$error":"#DIV/0!"},{"$error":"#DIV/0!"},{"$error":"#DIV/0!"},{"$error":"#DIV/0!"}]
["SES","Totex WR  - Allowed totex net of Grants & contributions, abstraction charges & business rates","£m",4.1577311095228247,4.2198808545040132,3.9502318786271742,3.7152327691690523,3.6314330768107927,19.674509688633858]
["SES","Totex WN  - Allowed totex net of Grants & contributions, abstraction charges & business rates","£m",39.206196654809872,42.479713092734727,38.1986712713842,32.746759334820297,31.542749104715178,184.17408945846427]
["SES","Totex WWN  - Allowed totex net of Grants & contributions, abstraction charges & business rates","£m",0,0,0,0,0,0]
["SES","Totex BR  - Allowed totex net of Grants & contributions, abstraction charges & business rates","£m",0,0,0,0,0,0]
["SES","Totex DMMY  - Allowed totex net of Grants & contributions, abstraction charges & business rates","£m",0,0,0,0,0,0]
["SES","WR opex for cost sharing",null,0.16201343262140774,0.15791423493982051,0.15397514228275985,0.14384532201067154,0.13830517910834517]
["SES","WR Capex for cost sharing",null,4.9312347554185842E-2,5.657044199939068E-2,4.6804035503269462E-2,4.4989511891968252E-2,4.6270352088180873E-2]
["SES","WN opex for cost sharing",null,9.0723832373108382E-2,8.772263773045004E-2,8.4113343238347502E-2,7.9428128936464795E-2,7.5764467169660038E-2]
["SES","WN Capex for cost sharing",null,0.12215191345025742,0.14292714160409054,0.12329189700853817,9.8375162672616187E-2,9.5501475816466896E-2]
["SES","WWN opex for cost sharing",null,{"$error":"#DIV/0!"},{"$error":"#DIV/0!"},{"$error":"#DIV/0!"},{"$error":"#DIV/0!"},{"$error":"#DIV/0!"}]
["SES","WWN Capex for cost sharing",null,{"$error":"#DIV/0!"},{"$error":"#DIV/0!"},{"$error":"#DIV/0!"},{"$error":"#DIV/0!"},{"$error":"#DIV/0!"}]
["SEW","Totex WR  - Allowed totex net of Grants & contributions, abstraction charges & business rates","£m",21.759154482371635,20.128647685706014,19.704673068709397,17.808778021561622,17.742790411314846,97.144043669663517]
["SEW","Totex WN  - Allowed totex net of Grants & contributions, abstraction charges & business rates","£m",107.12490479426516,123.6584244681416,128.20365029126228,116.32518217790353,120.3205430498642,595.6327047814367]
["SEW","Totex WWN  - Allowed totex net of Grants & contributions, abstraction charges & business rates","£m",0,0,0,0,0,0]
["SEW","Totex BR  - Allowed totex net of Grants & contributions, abstraction charges & business rates","£m",0,0,0,0,0,0]
["SEW","Totex DMMY  - Allowed totex net of Grants & contributions, abstraction charges & business rates","£m",0,0,0,0,0,0]
["SEW","WR opex for cost sharing",null,8.6292607870431776E-2,8.7353099981595531E-2,8.8330602548777309E-2,9.083468743714207E-2,9.2004211130196051E-2]
["SEW","WR Capex for cost sharing",null,0.13769595242013249,0.11985103652885382,0.11450914268269327,9.2488729509758325E-2,9.0639929890419385E-2]
["SEW","WN opex for cost sharing",null,0.10104577420554683,0.10453398818113453,0.1054268342209872,0.10700407813603531,0.10871510885333077]
["SEW","WN Capex for cost sharing",null,7.8804834960674003E-2,0.10307453209566458,0.1098126065654379,8.8292757051327719E-2,9.3289485729861163E-2]
["SEW","WWN opex for cost sharing",null,{"$error":"#DIV/0!"},{"$error":"#DIV/0!"},{"$error":"#DIV/0!"},{"$error":"#DIV/0!"},{"$error":"#DIV/0!"}]
["SEW","WWN Capex for cost sharing",null,{"$error":"#DIV/0!"},{"$error":"#DIV/0!"},{"$error":"#DIV/0!"},{"$error":"#DIV/0!"},{"$error":"#DIV/0!"}]
["SSC","Totex WR  - Allowed totex net of Grants & contributions, abstraction charges & business rates","£m",8.879069106107421,7.1968550039301622,6.723757127194288,6.7998394958644699,7.2402021515352928,36.839722884631634]
["SSC","Totex WN  - Allowed totex net of Grants & contributions, abstraction charges & business rates","£m",88.643710102544446,92.732958831173491,92.898979400479092,72.594856895069256,74.471179649935394,421.34168487920169]
["SSC","Totex WWN  - Allowed totex net of Grants & contributions, abstraction charges & business rates","£m",0,0,0,0,0,0]
["SSC","Totex BR  - Allowed totex net of Grants & contributions, abstraction charges & business rates","£m",0,0,0,0,0,0]
["SSC","Totex DMMY  - Allowed totex net of Grants & contributions, abstraction charges & business rates","£m",0,0,0,0,0,0]
["SSC","WR opex for cost sharing",null,9.0651062589907475E-2,9.0710030614220796E-2,9.9481672546819652E-2,9.9439377287442135E-2,9.9447475590481144E-2]
["SSC","WR Capex for cost sharing",null,0.15036782709917562,0.10464580923473914,8.3032108793246476E-2,8.5139630463486091E-2,9.7085005780481515E-2]
["SSC","WN opex for cost sharing",null,0.13131798214460808,0.12825800716574684,0.12290463112508385,0.11559293171806405,0.11553014097036354]
["SSC","WN Capex for cost sharing",null,7.90664001363868E-2,9.1831678139802655E-2,9.7579082531477707E-2,5.6701572956644658E-2,6.1217573111821841E-2]
["SSC","WWN opex for cost sharing",null,{"$error":"#DIV/0!"},{"$error":"#DIV/0!"},{"$error":"#DIV/0!"},{"$error":"#DIV/0!"},{"$error":"#DIV/0!"}]
["SSC","WWN Capex for cost sharing",null,{"$error":"#DIV/0!"},{"$error":"#DIV/0!"},{"$error":"#DIV/0!"},{"$error":"#DIV/0!"},{"$error":"#DIV/0!"}]
["ANH","Totex WR  - Allowed totex net of Grants & contributions, abstraction charges & business rates","£m",32.478227835079842,34.585699060752297,39.277760553534193,33.820101401022065,31.878577541839846,{"$f":"SUM(D141:H141)","v":172.04036639222824}]
["ANH","Totex WN  - Allowed totex net of Grants & contributions, abstraction charges & business rates","£m",299.0344184773013,372.20100978919584,416.55648229884156,401.87429184714074,302.78661599050395,1792.4528184029832]
["ANH","Totex WWN  - Allowed totex net of Grants & contributions, abstraction charges & business rates","£m",347.85434217047771,497.69778738855314,480.34978881700351,503.20349199601304,411.50049058276767,2240.6059009548148]
["ANH","Totex BR  - Allowed totex net of Grants & contributions, abstraction charges & business rates","£m",77.751809669009234,82.60308251670935,77.768416658343099,72.743520904901715,73.618162795285443,384.48499254424883]
["ANH","Totex DMMY  - Allowed totex net of Grants & contributions, abstraction charges & business rates","£m",0,0,0,0,0,0]
["ANH","WR opex for cost sharing",null,0.14168412683200804,0.13530757372559152,0.13745049537695939,0.13420233319459771,0.1508348370452979]
["ANH","WR Capex for cost sharing",null,4.7098474113132768E-2,6.5724892003420451E-2,9.0854996974680496E-2,6.2380027737585518E-2,3.4462242996726046E-2]
["ANH","WN opex for cost sharing",null,9.7117791401222689E-2,9.6293719086246038E-2,9.9121136402445825E-2,9.846898273133789E-2,9.8126639148900921E-2]
["ANH","WN Capex for cost sharing",null,6.9711937898838394E-2,0.11135526668779218,0.1332735341975757,0.12573457103650829,7.079642140913199E-2]
["ANH","WWN opex for cost sharing",null,7.8242205501638795E-2,7.9477879226663203E-2,8.0271193178798314E-2,8.0328904002608892E-2,8.152777721106326E-2]
["ANH","WWN Capex for cost sharing",null,7.7007917700412251E-2,0.14264854968993629,0.13411268781174382,0.14425476409430057,0.10212812158283451]
["NES","Totex WR  - Allowed totex net of Grants & contributions, abstraction charges & business rates","£m",23.469622164247049,23.16554176050132,21.325491045441446,19.700723842651534,19.464459778974422,107.12583859181578]
["NES","Totex WN  - Allowed totex net of Grants & contributions, abstraction charges & business rates","£m",238.27204502983386,249.23298505397685,241.19019893858712,223.36468237802185,209.01244978164164,1161.0723611820613]
["NES","Totex WWN  - Allowed totex net of Grants & contributions, abstraction charges & business rates","£m",146.35950486486021,164.32924913279615,186.33410761009651,243.21575585978323,194.66639406121746,934.90501152875356]
["NES","Totex BR  - Allowed totex net of Grants & contributions, abstraction charges & business rates","£m",15.454812677126348,15.408383761456921,15.309711843249904,15.214406009266767,15.121341046852784,76.508655337952717]
["NES","Totex DMMY  - Allowed totex net of Grants & contributions, abstraction charges & business rates","£m",0,0,0,0,0,0]
["NES","WR opex for cost sharing",null,0.14792851697779419,0.14559061312180263,0.14343811126749048,0.14130774270846144,0.13928521794198845]
["NES","WR Capex for cost sharing",null,7.1156089245676596E-2,7.0655458461072518E-2,5.563142532394285E-2,4.2594890882279364E-2,4.2411934069491598E-2]
["NES","WN opex for cost sharing",null,0.10430690681030941,0.10286805650026998,0.10199349801040559,0.10074089234560701,9.9757696631680368E-2]
["NES","WN Capex for cost sharing",null,0.1009103156436422,0.11178952504808284,0.10573705092199417,9.1637024695342406E-2,8.0259033392666115E-2]
["NES","WWN opex for cost sharing",null,7.2088465917567582E-2,7.1220848632482542E-2,7.0420651242954102E-2,6.9605993964669946E-2,6.8947194617979102E-2]
["NES","WWN Capex for cost sharing",null,8.4461668117475866E-2,0.10455021592100135,0.12888741247723451,0.19054423826274919,0.13927331084588573]
["NWT","Totex WR  - Allowed totex net of Grants & contributions, abstraction charges & business rates","£m",37.225487675516334,38.017191020489847,41.954332818504525,48.247812418644514,54.664893130286785,220.10971706344202]
["NWT","Totex WN  - Allowed totex net of Grants & contributions, abstraction charges & business rates","£m",370.34039247679925,356.38266143852081,357.10646905594456,337.53298064418425,312.61452749784041,1733.9770311132893]
["NWT","Totex WWN  - Allowed totex net of Grants & contributions, abstraction charges & business rates","£m",412.26096755310022,432.98162814209235,398.2004987502321,582.71817111113728,514.80609187775281,2340.9673574343151]
["NWT","Totex BR  - Allowed totex net of Grants & contributions, abstraction charges & business rates","£m",67.999740526466169,70.347336200062173,65.747569483812939,60.946406436365962,63.091246962484036,328.13229960919131]
["NWT","Totex DMMY  - Allowed totex net of Grants & contributions, abstraction charges & business rates","£m",0,0,0,0,0,0]
["NWT","WR opex for cost sharing",null,0.1272796465295859,0.13093158205635685,0.13711022879109477,0.15547759096127944,0.18546184980931996]
["NWT","WR Capex for cost sharing",null,4.18427719267827E-2,4.1787694165020491E-2,5.3496225927176795E-2,6.3721329751240008E-2,6.28910800821431E-2]
["NWT","WN opex for cost sharing",null,0.13828656415108517,0.14103868393766292,0.14048398537355244,0.14457564370703591,0.1404899726441739]
["NWT","WN Capex for cost sharing",null,7.5292039158916288E-2,6.4490371547984149E-2,6.5462496412695081E-2,5.0082632952761177E-2,3.9797610114132992E-2]
["NWT","WWN opex for cost sharing",null,8.6032105808001635E-2,8.7210110997799475E-2,8.7842604768472832E-2,9.2577520920925679E-2,9.629179010342219E-2]
["NWT","WWN Capex for cost sharing",null,9.0074992073506457E-2,9.774831089862436E-2,8.2258228754749516E-2,0.15634443403951973,0.12361990163497824]
["SRN","Totex WR  - Allowed totex net of Grants & contributions, abstraction charges & business rates","£m",15.798857573753802,15.482615840922064,15.376894722879525,16.764164632928534,19.15225873470871,82.574791505192636]
["SRN","Totex WN  - Allowed totex net of Grants & contributions, abstraction charges & business rates","£m",166.49167846951596,165.99499256671064,149.2050652166883,136.29410151711355,151.52703772853937,769.51287549856784]
["SRN","Totex WWN  - Allowed totex net of Grants & contributions, abstraction charges & business rates","£m",317.51783958604568,411.24394144445853,422.76215961186665,360.02473245146547,298.2483793622618,1809.7970524560981]
["SRN","Totex BR  - Allowed totex net of Grants & contributions, abstraction charges & business rates","£m",34.168329058956253,38.459996529907059,55.645777970590224,34.518202253712111,28.819772328395675,191.61207814156131]
["SRN","Totex DMMY  - Allowed totex net of Grants & contributions, abstraction charges & business rates","£m",0,0,0,0,0,0]
["SRN","WR opex for cost sharing",null,0.11535944870714035,0.11262387927108761,0.11656440693874504,0.11404551626990433,0.11065991053221526]
["SRN","WR Capex for cost sharing",null,7.5968404330917949E-2,7.4874212564220888E-2,6.9653377479306597E-2,8.8972430579823153E-2,0.12127841332663863]
["SRN","WN opex for cost sharing",null,8.0772205436225972E-2,7.888121714608258E-2,7.7512201353273455E-2,7.7756350789316905E-2,7.5714366553360404E-2]
["SRN","WN Capex for cost sharing",null,0.13558762916907016,0.13683316249852362,0.11638327456065234,9.9361025484353022E-2,0.12119856700914164]
["SRN","WWN opex for cost sharing",null,6.6852499815156133E-2,6.5356156176799712E-2,6.4352520703901614E-2,6.2685674778846609E-2,6.1145644717577267E-2]
["SRN","WWN Capex for cost sharing",null,0.10859139272248405,0.16187591986529254,0.16924392539381461,0.13624532246356319,0.10365094336256421]
["SWB","Totex WR  - Allowed totex net of Grants & contributions, abstraction charges & business rates","£m",9.1230288697341884,9.7048933225693332,8.7171484428673889,7.6183996687244528,7.3443838545430564,42.507854158438413]
["SWB","Totex WN  - Allowed totex net of Grants & contributions, abstraction charges & business rates","£m",125.08096255088061,137.07074111598695,150.99974712118794,142.78071723552392,139.24804382623893,695.18021184981831]
["SWB","Totex WWN  - Allowed totex net of Grants & contributions, abstraction charges & business rates","£m",166.16690261515666,161.92383901827191,146.44749015161671,145.35304231980379,134.48262546392391,754.37389956877303]
["SWB","Totex BR  - Allowed totex net of Grants & contributions, abstraction charges & business rates","£m",17.578565271231216,17.836103077284925,18.1165533800906,17.979076934792399,17.783325538614005,89.293624202013149]
["SWB","Totex DMMY  - Allowed totex net of Grants & contributions, abstraction charges & business rates","£m",0,0,0,0,0,0]
["SWB","WR opex for cost sharing",null,0.1106441772268336,0.11209213822105252,0.11248759923028462,0.11321442544296266,0.11421470917219669]
["SWB","WR Capex for cost sharing",null,0.10397566304386467,0.11621610068455157,9.2583877922530228E-2,6.6008916208878693E-2,5.8562392846844925E-2]
["SWB","WN opex for cost sharing",null,8.8558427034597653E-2,8.9044273458485049E-2,8.8492417021321004E-2,8.6984804337007587E-2,8.6495341824100846E-2]
["SWB","WN Capex for cost sharing",null,9.1367526579718111E-2,0.1081286879974413,0.12871708426668285,0.11840182031330572,0.11380961716733987]
["SWB","WWN opex for cost sharing",null,8.8456827970897711E-2,8.8036434809993597E-2,8.7502973902532352E-2,8.542195133690321E-2,8.4383676211970474E-2]
["SWB","WWN Capex for cost sharing",null,0.13181444958807348,0.12661022662783364,0.10662819929332089,0.1072584189713654,9.3886841287109182E-2]
["TMS","Totex WR  - Allowed totex net of Grants & contributions, abstraction charges & business rates","£m",76.708339846675955,80.832602359995462,88.936744014644916,73.090791016649376,57.93259829569395,377.50107553365962]
["TMS","Totex WN  - Allowed totex net of Grants & contributions, abstraction charges & business rates","£m",800.76469551086655,821.22592762297802,765.00816526992958,725.03927839254322,684.57815705204553,3796.616223848363]
["TMS","Totex WWN  - Allowed totex net of Grants & contributions, abstraction charges & business rates","£m",708.41248398678636,746.36304278546163,751.52719096486112,704.86464085508135,634.89300232980781,3546.0603609219979]
["TMS","Totex BR  - Allowed totex net of Grants & contributions, abstraction charges & business rates","£m",81.745021119225953,123.7072804756062,126.83924845835274,110.72580124627738,94.162438455347299,537.17978975480958]
["TMS","Totex DMMY  - Allowed totex net of Grants & contributions, abstraction charges & business rates","£m",22.615581632843906,34.370488206182266,20.109318560853726,-190.96451324550594,-216.73400977426579,-330.60313461989182]
["TMS","WR opex for cost sharing",null,0.11739107899715051,0.12161883374681554,0.11280366616429675,0.10811803885585715,0.11444871973762152]
["TMS","WR Capex for cost sharing",null,8.5809242321765372E-2,9.2506655156031556E-2,0.12278968648752885,8.54993989575943E-2,3.901467957533869E-2]
["TMS","WN opex for cost sharing",null,7.9769223526007946E-2,7.8158412685573761E-2,7.4781298692919884E-2,7.1910989336810463E-2,7.1486234622697903E-2]
["TMS","WN Capex for cost sharing",null,0.13114614118240805,0.1381462858152821,0.12671606637246316,0.11905887320505634,0.10882647456078046]
["TMS","WWN opex for cost sharing",null,9.1087381766673234E-2,8.6633117760928594E-2,8.5232730785754135E-2,8.4703302022168747E-2,8.5777505020763284E-2]
["TMS","WWN Capex for cost sharing",null,0.10868713188616108,0.12384357096396452,0.12670026371337481,0.11407070888378551,9.3264287196426043E-2]
["WSH","Totex WR  - Allowed totex net of Grants & contributions, abstraction charges & business rates","£m",47.18228267453344,54.161536019755886,51.157470052779416,47.139424410435481,34.617629500825643,{"$f":"SUM(D207:H207)","v":234.25834265832987}]
["WSH","Totex WN  - Allowed totex net of Grants & contributions, abstraction charges & business rates","£m",215.24703343669927,210.04078322100943,198.2370085962587,189.94413070630497,188.88411741731787,1002.3530733775904]
["WSH","Totex WWN  - Allowed totex net of Grants & contributions, abstraction charges & business rates","£m",256.97719234808022,236.60536149642229,244.82356772424174,235.78565494365202,233.51114072545542,1207.7029172378518]
["WSH","Totex BR  - Allowed totex net of Grants & contributions, abstraction charges & business rates","£m",25.001134668896825,24.606687813921134,24.850366263525867,24.082260475241441,23.405347182008231,121.94579640359349]
["WSH","Totex DMMY  - Allowed totex net of Grants & contributions, abstraction charges & business rates","£m",0,0,0,0,0,0]
["WSH","WR opex for cost sharing",null,8.2838525363534421E-2,8.8100521951705174E-2,9.1008984912772609E-2,9.1164232745034587E-2,7.8627356332719223E-2]
["WSH","WR Capex for cost sharing",null,0.11857279744834799,0.1431037775628333,0.12737158361790094,0.1100641370773764,6.9148082987775347E-2]
["WSH","WN opex for cost sharing",null,0.10533434288630314,0.10071495904682887,9.732003030400764E-2,9.4564055256379537E-2,9.6448055784994297E-2]
["WSH","WN Capex for cost sharing",null,0.10940738750156276,0.10883274305502948,0.10045160711739236,9.4934172215760212E-2,9.1992646831741742E-2]
["WSH","WWN opex for cost sharing",null,9.913753957722736E-2,0.10540985761597053,0.10576330143884813,0.10479260739377975,0.10415134842013149]
["WSH","WWN Capex for cost sharing",null,0.11364425359407264,9.0503688769728849E-2,9.6955069304330954E-2,9.0442207044624981E-2,8.9200126841285379E-2]
["WSX","Totex WR  - Allowed totex net of Grants & contributions, abstraction charges & business rates","£m",18.914292094766171,13.36001477474915,13.767457743215932,10.557378483539964,9.8195032649625595,66.418646361233783]
["WSX","Totex WN  - Allowed totex net of Grants & contributions, abstraction charges & business rates","£m",85.51034760738132,83.032268526489474,101.80520879658272,86.377335720858355,81.630909314523763,438.35606996583562]
["WSX","Totex WWN  - Allowed totex net of Grants & contributions, abstraction charges & business rates","£m",266.47436873197341,249.33012810194484,246.55224307621225,242.97935505673809,231.78121866671211,1237.1173136335806]
["WSX","Totex BR  - Allowed totex net of Grants & contributions, abstraction charges & business rates","£m",21.095017986922571,20.398422325443462,23.119578690079532,21.406388068200123,24.615267560617227,110.63467463126291]
["WSX","Totex DMMY  - Allowed totex net of Grants & contributions, abstraction charges & business rates","£m",0,0,0,0,0,0]
["WSX","WR opex for cost sharing",null,9.6909583115797615E-2,9.9662115984483712E-2,0.11479630140556592,9.9736372502791146E-2,0.10088486358384358]
["WSX","WR Capex for cost sharing",null,0.18786424367820603,0.1014864395293926,9.2486720719550872E-2,5.9215654705368458E-2,4.6957704774999942E-2]
["WSX","WN opex for cost sharing",null,0.10838235493397499,0.10918691408859872,0.11014546173903282,0.11139290405029334,0.11294989161994552]
["WSX","WN Capex for cost sharing",null,8.6688167561688817E-2,8.0230489286152756E-2,0.1220977208511322,8.5655435505242808E-2,7.3270660363937964E-2]
["WSX","WWN opex for cost sharing",null,5.9615152338105527E-2,6.0976521058959891E-2,6.2824376140327529E-2,6.5202311377984615E-2,6.6960861971282939E-2]
["WSX","WWN Capex for cost sharing",null,0.15578428132538608,0.14056469524624932,0.13647139020219906,0.13120537961380574,0.12039503072569935]
["YKY","Totex WR  - Allowed totex net of Grants & contributions, abstraction charges & business rates","£m",33.812527226292858,28.846994655246526,39.083472837904758,33.154848695510402,22.500482191741071,157.39832560669561]
["YKY","Totex WN  - Allowed totex net of Grants & contributions, abstraction charges & business rates","£m",280.80552050191699,285.88434189079811,286.10271933828,275.08679345586438,257.3015391094271,1385.1809142962866]
["YKY","Totex WWN  - Allowed totex net of Grants & contributions, abstraction charges & business rates","£m",505.72149928896698,503.50345175692223,421.12535110455536,336.10156929230595,257.17233516431293,2023.6242066070633]
["YKY","Totex BR  - Allowed totex net of Grants & contributions, abstraction charges & business rates","£m",60.189965042566975,61.056090702255844,56.114715311708665,69.400081273030693,52.697900450256824,299.45875277981901]
["YKY","Totex DMMY  - Allowed totex net of Grants & contributions, abstraction charges & business rates","£m",0,0,0,0,0,0]
["YKY","WR opex for cost sharing",null,8.9672109840645886E-2,8.9904596902622466E-2,9.0207013567315295E-2,9.0542947676426885E-2,9.7781146001508362E-2]
["YKY","WR Capex for cost sharing",null,0.12514928102206921,9.3369237453969953E-2,0.15810231683538484,0.12010000908765713,4.5171341612399989E-2]
["YKY","WN opex for cost sharing",null,0.12044217437509785,0.11790326003304472,0.1183997820544896,0.11899072977730095,0.11947254222888884]
["YKY","WN Capex for cost sharing",null,8.2279013596636946E-2,8.8484468053748863E-2,8.8145598686356644E-2,7.9601952677912299E-2,6.6280478516523286E-2]
["YKY","WWN opex for cost sharing",null,6.1283700511316146E-2,6.109008940583889E-2,5.9353828630985393E-2,6.3119466824869616E-2,6.5477840446020091E-2]
["YKY","WWN Capex for cost sharing",null,0.18862510055846929,0.18772263487024005,0.14875069479267974,0.10296945828036776,6.160718567921307E-2]
["SVE","Totex WR  - Allowed totex net of Grants & contributions, abstraction charges & business rates","£m",46.758001865857466,48.532632587365178,51.55752318387605,56.806374188220282,59.762712023584832,263.41724384890381]
["SVE","Totex WN  - Allowed totex net of Grants & contributions, abstraction charges & business rates","£m",399.31928516797956,435.30547586975672,428.43016798699546,414.62577464609961,405.14059587861971,2082.8212995494514]
["SVE","Totex WWN  - Allowed totex net of Grants & contributions, abstraction charges & business rates","£m",501.1552974857745,539.60495297853095,542.10764356350489,533.1982135140122,475.38914055744084,2591.4552480992638]
["SVE","Totex BR  - Allowed totex net of Grants & contributions, abstraction charges & business rates","£m",62.053963930399661,61.215386756368275,59.177725849373765,56.490212278655065,50.891195344405205,289.82848415920199]
["SVE","Totex DMMY  - Allowed totex net of Grants & contributions, abstraction charges & business rates","£m",0,0,0,0,0,0]
["SVE","WR opex for cost sharing",null,0.11454817027902413,0.12098577689096564,0.12019289869822591,0.1216492854459448,0.12686392013012396]
["SVE","WR Capex for cost sharing",null,6.2957300443605813E-2,6.3256651122606269E-2,7.5532796516508974E-2,9.4002405985480333E-2,0.10001079448751411]
["SVE","WN opex for cost sharing",null,0.11312550680014197,0.11640205267559615,0.11556397939259951,0.11293109215106942,0.11404633847825615]
["SVE","WN Capex for cost sharing",null,7.8594870389374447E-2,9.259594247834263E-2,9.0133056680380921E-2,8.6138206177975921E-2,8.0468954776262758E-2]
["SVE","WWN opex for cost sharing",null,0.10041362496179547,9.965296738621017E-2,9.8092319338433959E-2,9.7456028334674399E-2,9.7835167603185072E-2]
["SVE","WWN Capex for cost sharing",null,9.2973969847473761E-2,0.10857171771082605,0.11109811293359574,0.10829640127223988,8.5609690611565578E-2]
["HDD","Totex WR  - Allowed totex net of Grants & contributions, abstraction charges & business rates","£m",4.0716105717473612,4.0760955117298163,2.4431227171688801,2.3207692656098544,2.2986857948513153,15.210283861107229]
["HDD","Totex WN  - Allowed totex net of Grants & contributions, abstraction charges & business rates","£m",18.984052492551243,18.73503685711129,19.146211450840461,18.763548801671778,18.910954807002042,94.53980440917681]
["HDD","Totex WWN  - Allowed totex net of Grants & contributions, abstraction charges & business rates","£m",4.0587286046555873,4.3899116836237653,4.5725410343130815,5.6484720856465396,4.1231254897881229,22.792778898027098]
["HDD","Totex BR  - Allowed totex net of Grants & contributions, abstraction charges & business rates","£m",0.6195482976432195,0.64937049727378049,0.64937049727378049,0.64937049727378149,0.64937049727378049,3.2170302867383427]
["HDD","Totex DMMY  - Allowed totex net of Grants & contributions, abstraction charges & business rates","£m",0,0,0,0,0,0]
["HDD","WR opex for cost sharing",null,0.13525774827104772,0.13084535796669103,7.9685276260250862E-2,7.7600527534629871E-2,7.7758057254620913E-2]
["HDD","WR Capex for cost sharing",null,0.13243025866736916,0.13713751131771551,8.0937808718193061E-2,7.4978430675615854E-2,7.3369023333866107E-2]
["HDD","WN opex for cost sharing",null,0.1353120536265498,0.12985719653566227,0.12965574844078273,0.12821155960269529,0.1305011696408746]
["HDD","WN Capex for cost sharing",null,6.5492809586267381E-2,6.8313690046928457E-2,7.2864360104967205E-2,7.0260913647423137E-2,6.9530498767848975E-2]
["HDD","WWN opex for cost sharing",null,0.11226588621991321,0.11262727851061267,0.11111298112648868,0.11048102598372379,0.11057569497408481]
["HDD","WWN Capex for cost sharing",null,6.5804923961415948E-2,7.9973707234207977E-2,8.9500601568725038E-2,0.13733746560597268,7.0320434814855184E-2]

{"sheet":"InpActive","index":9,"n_rows":303,"n_cols":16,"rows_kept":303,"cut":false,"hidden":false,"merged":[]}
[{"$f":" RIGHT(CELL(\"filename\", $A$1), LEN(CELL(\"filename\", $A$1)) - SEARCH(\"]\", CELL(\"filename\", $A$1)))","v":{"$error":"#VALUE!"}},null,null,null,null,null,null,null,null,null,null,null,null,null,null,"WSX"]
[null,null,null,null,{"$f":"Time!E$22","v":"Model Period BEG"},null,null,null,null,{"$f":"Time!J$22","v":"2019-04-01"},{"$f":"Time!K$22","v":"2020-04-01"},{"$f":"Time!L$22","v":"2021-04-01"},{"$f":"Time!M$22","v":"2022-04-01"},{"$f":"Time!N$22","v":"2023-04-01"},{"$f":"Time!O$22","v":"2024-04-01"},{"$f":"Time!P$22","v":"2025-04-01"}]
[null,null,null,null,{"$f":"Time!E$23","v":"Model Period END"},{"$f":"Check!F$8","v":0},"Error chks",null,null,{"$f":"Time!J$23","v":"2020-03-31"},{"$f":"Time!K$23","v":"2021-03-31"},{"$f":"Time!L$23","v":"2022-03-31"},{"$f":"Time!M$23","v":"2023-03-31"},{"$f":"Time!N$23","v":"2024-03-31"},{"$f":"Time!O$23","v":"2025-03-31"},{"$f":"Time!P$23","v":"2026-03-31"}]
[null,null,null,null,{"$f":"Time!E$59","v":"Pre Forecast vs Forecast"},null,null,null,null,{"$f":"Time!J$59","v":"Pre Fcst"},{"$f":"Time!K$59","v":"Forecast"},{"$f":"Time!L$59","v":"Forecast"},{"$f":"Time!M$59","v":"Forecast"},{"$f":"Time!N$59","v":"Forecast"},{"$f":"Time!O$59","v":"Forecast"},{"$f":"Time!P$59","v":"Post-Fcst"}]
[null,null,null,null,{"$f":"Time!E$101","v":"Financial Year Ending"},null,null,null,null,{"$f":"Time!J$101","v":2020},{"$f":"Time!K$101","v":2021},{"$f":"Time!L$101","v":2022},{"$f":"Time!M$101","v":2023},{"$f":"Time!N$101","v":2024},{"$f":"Time!O$101","v":2025},{"$f":"Time!P$101","v":2026}]
[null,null,null,null,{"$f":"Time!E$11","v":"Model column counter"},"Constant","Unit","Total",null,{"$f":"Time!J$11","v":1},{"$f":"Time!K$11","v":2},{"$f":"Time!L$11","v":3},{"$f":"Time!M$11","v":4},{"$f":"Time!N$11","v":5},{"$f":"Time!O$11","v":6},{"$f":"Time!P$11","v":7}]
[]
["TIME"]
[]
[null,null,null,null,"First date of time ruler","2019-04-01","date"]
[]
[null,null,null,null,"Last Pre Forecast Date","2020-03-31","date"]
[]
[null,null,null,null,"Acquisition date (midnight)","2020-03-31","date"]
[null,null,null,null,"Length of forecast period",5,"years"]
[null,null,null,null,"Last forecast date",{"$f":"DATE(YEAR(F14)+F15,MONTH(F14),DAY(F14))","v":"2025-03-31"},"date"]
[]
[]
[null,null,null,null,"Operation Start Date (midnight)","2021-03-31","date"]
[null,null,null,null,"Operation Finish Date (midnight)","2025-03-31","date"]
[null,null,null,null,"First Modelling Column Financial Year Number",2020,"year"]
[null,null,null,null,"Financial Year End Month Number",3,"month #"]
[]
[]
["TOTEX INPUTS"]
[]
[null,"Water Resources"]
[null,null,"Wage adjustment"]
["C_TBC_WR_PR19CA004_OFWAT",null,null,"2017/18 CPIH","Base Costs - WR - Real",60.8,"£m"]
[null,null,null,"2017/18 CPIH","Metering (excluding new connections) for meters requested by optants, customers and businesses - WR - Real",null,"£m"]
[]
["C_OPEX_SPLIT_BASE_WR_PR19CA091",null,null,null,"Opex split profile - Base costs - WR ",null,"%",null,null,null,0.14434578369805173,0.14983284433448402,0.16636012381742027,0.14991393612749104,0.15116814522775562]
["C_CAPEX_SPLIT_BASE_WR_PR19CA091",null,null,null,"Capex Split Profile - Base costs - WR",null,"%",null,null,null,4.6275016569606399E-2,6.8844429679159908E-2,5.5149711608228472E-2,3.4161867220366939E-2,3.3948141717435654E-2]
[]
["WR opex for cost sharing",null,null,null,"Opex split profile - Cost sharing - WR",null,"%",null,null,null,9.6909583115797615E-2,9.9662115984483712E-2,0.11479630140556592,9.9736372502791146E-2,0.10088486358384358]
["WR Capex for cost sharing",null,null,null,"Capex split profile - Cost sharing - WR",null,"%",null,null,null,0.18786424367820603,0.1014864395293926,9.2486720719550872E-2,5.9215654705368458E-2,4.6957704774999942E-2]
[]
[null,null,null,null,"Business Rates  forecast profile - WR",null,"%",null,null,null,0.2,0.2,0.2,0.2,0.2]
[null,null,null,null,"Abstraction Charges forecast profile - WR",null,"%",null,null,null,0.2,0.2,0.2,0.2,0.2]
[]
[null,null,"Net totex for cost sharing reconciliation"]
[null,null,null,"nominal","Net totex for cost sharing reconciliation - WR - Nominal",null,"£m",null,null,null,9.2840000000000007,10.571000000000002,13.416,{"$f":"[1]Workings!$F$29-[1]Workings!$F$45","v":14.293590415300001},{"$f":"([2]Workings!$G$52+[2]Workings!$G$28-SUM([2]CW11!$O$18:$O$19)-SUM([2]CW11!$O$37:$O$38)-[2]Workings!$G$62)*'[2]PD1 inflation'!$B$6 +N(\"PD9 adjed Total totex, add back S185 diversions, remove NonS185 diversions, remove Disallowable costs\")","v":18.70673979922287}]
["Totex WR  - Allowed totex net of Grants & contributions, abstraction charges & business rates",null,null,"2017/18 CPIH","Net totex available for cost sharing - WR - Real",66.400000000000006,"£m"]
[null,null,null,"nominal","Performance related pay recovery mechanism adjustment - WR - Nominal (Neg)",null,"£m",null,null,null,0,0,0,0,0]
[]
["C__PR24PD11_PD11_12WR_PRETVM_PR24",null,null,"2017/18 CPIH","Total final WINEP reconciliation - WR - real",null,"£m",null,null,null,0,0,0,0,0]
[]
[null,null,"Business Rates and Abstraction"]
["C_UBC_WR_PR19CA004_OFWAT",null,null,"2017/18 CPIH","Business rates - Forecast - WR - Real",3.2810145914608184,"£m"]
["WS1003_WW4_WR",null,null,"2017/18 CPIH","Abstraction charges - Forecast - WR - Real",11.222511023359866,"£m"]
[]
[null,null,null,"nominal","Business rates - Actual - WR - Nominal",null,"£m",null,null,null,0.96764071120538453,0.96138774503593794,0.97399999999999998,0.621,{"$f":"[2]Workings!$G$48*'[2]PD1 inflation'!$B$6","v":0.7513197185791628}]
[null,null,null,"nominal","Abstraction charges - Actual - WR - Nominal",null,"£m",null,null,null,2.4794626375340818,2.5835450156070361,2.7320000000000002,2.806,{"$f":"[2]Workings!$G$47*'[2]PD1 inflation'!$B$6","v":3.0028447111317265}]
[]
[null,null,null,null,"Weighted average PAYG rate - WR",0.64100000000000001,"%"]
[]
["C_WR_CS_EXANTE_001",null,null,"2017/18 CPIH","Ex ante allowance above Ofwat forecast  - Water Resources - Real",0,"£m"]
[]
[null,null,"Bad Debt"]
[null,null,null,"2017/18 CPIH","Business retail bad debt liability due to covid liquidity measures - WR - real",0,"£m"]
[null,null,null,"2017/18 CPIH","Total Wholesaler Liability - WR - real",0,"£m"]
[]
[null,null,"CMA exclusions"]
[null,null,null,"nominal","Actuals for CMA excluded items - WR - nominal",null,"£m",null,null,null,{"$f":"SUMIF('Consolidated actual totex inp'!$L:$L, InpActive!$E64, 'Consolidated actual totex inp'!G:G)","v":0},{"$f":"SUMIF('Consolidated actual totex inp'!$L:$L, InpActive!$E64, 'Consolidated actual totex inp'!H:H)","v":0},{"$f":"SUMIF('Consolidated actual totex inp'!$L:$L, InpActive!$E64, 'Consolidated actual totex inp'!I:I)","v":0},{"$f":"SUMIF('Consolidated actual totex inp'!$L:$L, InpActive!$E64, 'Consolidated actual totex inp'!J:J)","v":0},{"$f":"SUMIF('Consolidated actual totex inp'!$L:$L, InpActive!$E64, 'Consolidated actual totex inp'!K:K)","v":0}]
[null,null,null,"2017/18 CPIH","Allowance for CMA excluded items - WR - real",null,"£m",null,null,null,{"$f":"SUMIFS('Non-fountain inputs'!C$8:C$23, 'Non-fountain inputs'!$A$8:$A$23, InpActive!$P$1, 'Non-fountain inputs'!$B$8:$B$23, InpActive!$E65)","v":0},{"$f":"SUMIFS('Non-fountain inputs'!D$8:D$23, 'Non-fountain inputs'!$A$8:$A$23, InpActive!$P$1, 'Non-fountain inputs'!$B$8:$B$23, InpActive!$E65)","v":0},{"$f":"SUMIFS('Non-fountain inputs'!E$8:E$23, 'Non-fountain inputs'!$A$8:$A$23, InpActive!$P$1, 'Non-fountain inputs'!$B$8:$B$23, InpActive!$E65)","v":0},{"$f":"SUMIFS('Non-fountain inputs'!F$8:F$23, 'Non-fountain inputs'!$A$8:$A$23, InpActive!$P$1, 'Non-fountain inputs'!$B$8:$B$23, InpActive!$E65)","v":0},{"$f":"SUMIFS('Non-fountain inputs'!G$8:G$23, 'Non-fountain inputs'!$A$8:$A$23, InpActive!$P$1, 'Non-fountain inputs'!$B$8:$B$23, InpActive!$E65)","v":0}]
["PD9_13WR_PR24",null,null,null,"CMA excluded items sharing rate - WR - real",0,"%"]
[]
[null,"Water Network"]
[null,null,"Wage adjustment"]
["C_TBC_WN_PR19CA004_OFWAT",null,null,"2017/18 CPIH","Base Costs - WN - Real",486.2,"£m"]
["C_PR19_E_W_METERING_WN",null,null,"2017/18 CPIH","Metering (excluding new connections) for meters requested by optants, customers and businesses - WN - Real",10.924016350800301,"£m"]
[]
["C_OPEX_SPLIT_BASE_WN_PR19CA091",null,null,null,"Opex Split Profile - Base costs - WN",null,"%",null,null,null,0.13,0.13,0.13,0.13,0.13]
["C_CAPEX_SPLIT_BASE_WN_PR19CA091",null,null,null,"Capex Split Profile - Base costs - WN",null,"%",null,null,null,6.9000000000000006E-2,0.06,9.7000000000000003E-2,6.7000000000000004E-2,5.7000000000000002E-2]
[]
["WN opex for cost sharing",null,null,null,"Opex split profile - Cost sharing - WN",null,"%",null,null,null,0.10838235493397499,0.10918691408859872,0.11014546173903282,0.11139290405029334,0.11294989161994552]
["WN Capex for cost sharing",null,null,null,"Capex split profile - Cost sharing - WN",null,"%",null,null,null,8.6688167561688817E-2,8.0230489286152756E-2,0.1220977208511322,8.5655435505242808E-2,7.3270660363937964E-2]
[]
[null,null,null,null,"Business Rates forecast profile - WN",null,"%",null,null,null,0.2,0.2,0.2,0.2,0.2]
[null,null,null,null,"Abstraction Charges forecast profile - WN",null,"%",null,null,null,0.2,0.2,0.2,0.2,0.2]
[]
[null,null,"Net totex for cost sharing reconciliation"]
[null,null,null,"nominal","Net totex for cost sharing reconciliation - WN  - Nominal",null,"£m",null,null,null,119.90600000000001,118.23,131.114,{"$f":"[1]Workings!$G$29-[1]Workings!$G$45","v":137.23737317189844},{"$f":"([2]Workings!$H$52+[2]Workings!$H$28-SUM([2]CW11!$P$18:$R$19)-SUM([2]CW11!$P$37:$R$38)-[2]Workings!$H$62)*'[2]PD1 inflation'!$B$6 +N(\"PD9 Total totex, add back S185 diversions, remove NonS185 diversions,  remove Disallowable costs\")","v":127.77413765953555}]
["Totex WN  - Allowed totex net of Grants & contributions, abstraction charges & business rates",null,null,"2017/18 CPIH","Net totex available for cost sharing - WN  - Real",438.4,"£m"]
[null,null,null,"nominal","Performance related pay recovery mechanism adjustment  - WN - Nominal (Neg)",null,"£m",null,null,null,0,0,0,0,0]
[]
["C__PR24PD11_PD11_12WN_PRETVM_PR24",null,null,"2017/18 CPIH","Total final WINEP reconciliation - WN - real",null,"£m",null,null,null,0,0,0,0,0]
[]
[null,null,"Business Rates and Abstraction"]
["C_UBC_WN_PR19CA004_OFWAT",null,null,"2017/18 CPIH","Business rates - Forecast - WN  - Real",68.609227970398777,"£m"]
["WS1003_WW4_WN",null,null,"2017/18 CPIH","Abstraction charges - Forecast - WN - Real",1.4761620238208066,"£m"]
[]
[null,null,null,"nominal","Business rates - Actual - WN - Nominal",null,"£m",null,null,null,15.051752578547637,14.929807562819281,14.994,10.239000000000001,{"$f":"[2]Workings!$H$48*'[2]PD1 inflation'!$B$6","v":11.562400220448565}]
[null,null,null,"nominal","Abstraction charges - Actual - WN - Nominal",null,"£m",null,null,null,0.14249923032281106,0.14298974377236701,0.152,0.16,{"$f":"[2]Workings!$H$47*'[2]PD1 inflation'!$B$6","v":1.3083020360970177}]
[]
[null,null,null,null,"Weighted average PAYG rate - WN",0.72199999999999998,"%"]
[]
["C_WN_CS_EXANTE_001",null,null,"2017/18 CPIH","Ex ante allowance above Ofwat forecast  - Water Network - Real",0,"£m"]
[]
[null,null,"Bad Debt"]
[null,null,null,"2017/18 CPIH","Business retail bad debt liability due to covid liquidity measures - WN - real",0,"£m"]
[null,null,null,"2017/18 CPIH","Total Wholesaler Liability - WN - real",0,"£m"]
[]
[null,null,"CMA exclusions"]
[null,null,null,"nominal","Actuals for CMA excluded items - WN - nominal",null,"£m",null,null,null,{"$f":"SUMIF('Consolidated actual totex inp'!$L:$L, InpActive!$E105, 'Consolidated actual totex inp'!G:G)","v":0},{"$f":"SUMIF('Consolidated actual totex inp'!$L:$L, InpActive!$E105, 'Consolidated actual totex inp'!H:H)","v":0},{"$f":"SUMIF('Consolidated actual totex inp'!$L:$L, InpActive!$E105, 'Consolidated actual totex inp'!I:I)","v":0},{"$f":"SUMIF('Consolidated actual totex inp'!$L:$L, InpActive!$E105, 'Consolidated actual totex inp'!J:J)","v":0},{"$f":"SUMIF('Consolidated actual totex inp'!$L:$L, InpActive!$E105, 'Consolidated actual totex inp'!K:K)","v":0}]
[null,null,null,"2017/18 CPIH","Allowance for CMA excluded items - WN - real",null,"£m",null,null,null,{"$f":"SUMIFS('Non-fountain inputs'!C$8:C$23, 'Non-fountain inputs'!$A$8:$A$23, InpActive!$P$1, 'Non-fountain inputs'!$B$8:$B$23, InpActive!$E106)","v":0},{"$f":"SUMIFS('Non-fountain inputs'!D$8:D$23, 'Non-fountain inputs'!$A$8:$A$23, InpActive!$P$1, 'Non-fountain inputs'!$B$8:$B$23, InpActive!$E106)","v":0},{"$f":"SUMIFS('Non-fountain inputs'!E$8:E$23, 'Non-fountain inputs'!$A$8:$A$23, InpActive!$P$1, 'Non-fountain inputs'!$B$8:$B$23, InpActive!$E106)","v":0},{"$f":"SUMIFS('Non-fountain inputs'!F$8:F$23, 'Non-fountain inputs'!$A$8:$A$23, InpActive!$P$1, 'Non-fountain inputs'!$B$8:$B$23, InpActive!$E106)","v":0},{"$f":"SUMIFS('Non-fountain inputs'!G$8:G$23, 'Non-fountain inputs'!$A$8:$A$23, InpActive!$P$1, 'Non-fountain inputs'!$B$8:$B$23, InpActive!$E106)","v":0}]
["PD9_13WN_PR24",null,null,null,"CMA excluded items sharing rate - WN - real",0,"%"]
[]
[null,"Wastewater Network"]
[null,null,"Wage adjustment"]
["C_TBC_WWN_PR19CA008_OFWAT",null,null,"2017/18 CPIH","Base Costs - WWN - Real",884.6,"£m"]
[null,null,null,"2017/18 CPIH","Metering (excluding new connections) for meters requested by optants, customers and businesses - WWN - Real",null,"£m"]
["C_PR19_E_WW_WINEP_WWN",null,null,"2017/18 CPIH","WINEP / NEP ~ In-the-Round - WWN - Real",384.1,"£m"]
[]
["C_OPEX_SPLIT_BASE_WWN_PR19CA091",null,null,null,"Opex Split Profile - Base costs - WWN",null,"%",null,null,null,0.09,9.0999999999999998E-2,9.1999999999999998E-2,9.2999999999999999E-2,9.4E-2]
["C_CAPEX_SPLIT_BASE_WWN_PR19CA091",null,null,null,"Capex Split Profile - Base costs - WWN",null,"%",null,null,null,0.1,0.108,0.109,0.114,0.108]
[]
["WWN opex for cost sharing",null,null,null,"Opex split profile - Cost sharing - WWN",null,"%",null,null,null,5.9615152338105527E-2,6.0976521058959891E-2,6.2824376140327529E-2,6.5202311377984615E-2,6.6960861971282939E-2]
["WWN Capex for cost sharing",null,null,null,"Capex split profile - Cost sharing - WWN",null,"%",null,null,null,0.15578428132538608,0.14056469524624932,0.13647139020219906,0.13120537961380574,0.12039503072569935]
[]
[null,null,null,null,"Business Rates forecast profile - WWN",null,"%",null,null,null,0.2,0.2,0.2,0.2,0.2]
[]
[null,null,"Net totex for cost sharing reconciliation"]
[null,null,null,"nominal","Net totex for cost sharing reconciliation - WWN - nominal",null,"£m",null,null,null,237.078,235.87300000000002,262.85399999999998,{"$f":"[1]Workings!$H$29-[1]Workings!$H$45","v":356.47937337486906},{"$f":"([2]Workings!$I$52+[2]Workings!$I$28-SUM([2]CWW11!$Q$14:$R$15)-SUM([2]CWW11!$Q$31:$R$32)-[2]Workings!$I$62)*'[2]PD1 inflation'!$B$6 +N(\"PD9 adjusted Total totex, add back S185 diversions, remove NonS185 diversions, remove Disallowable costs\")","v":377.67601618112207}]
["Totex WWN  - Allowed totex net of Grants & contributions, abstraction charges & business rates",null,null,"2017/18 CPIH","Net totex available for cost sharing - WWN - Real",1237.0999999999999,"£m"]
[null,null,null,"nominal","Performance related pay recovery mechanism adjustment  - WWN - Nominal (Neg)",null,"£m",null,null,null,0,0,0,0,0]
[]
["C__PR24PD11_PD11_12WWN_PRETVM_PR24",null,null,"2017/18 CPIH","Total final WINEP reconciliation - WWN - real",null,"£m",null,null,null,0,0,{"$f":"[3]Annual_Outputs!N$28","v":-0.21525573333333334},{"$f":"[3]Annual_Outputs!O$28","v":-0.21525573333333334},{"$f":"[3]Annual_Outputs!P$28","v":-0.21525573333333334}]
[]
[null,null,"Business Rates and Abstraction"]
["C_UBC_WWN_PR19CA008_OFWAT",null,null,"2017/18 CPIH","Business rates - Forecast - WWN - Real",34.793493596545602,"£m"]
[]
[null,null,null,"nominal","Business rates - Actual - WWN - Nominal",null,"£m",null,null,null,7.1502332510739732,7.147619918277317,7.1479999999999997,8.1289999999999996,{"$f":"[2]Workings!$I$48*'[2]PD1 inflation'!$B$6","v":10.255331064098332}]
[]
[null,null,null,null,"Weighted average PAYG rate - WWN",0.40300000000000002,"%"]
[]
["C_WWN_CS_EXANTE_001",null,null,"2017/18 CPIH","Ex ante allowance above Ofwat forecast  - Wastewater Network - Real",0,"£m"]
[]
[null,null,"Bad Debt"]
[null,null,null,"2017/18 CPIH","Business retail bad debt liability due to covid liquidity measures - WWN - real",0,"£m"]
[null,null,null,"2017/18 CPIH","Total Wholesaler Liability - WWN - real",0,"£m"]
[]
[null,null,"CMA exclusions"]
[null,null,null,"nominal","Actuals for CMA excluded items - WWN - nominal",null,"£m",null,null,null,{"$f":"SUMIF('Consolidated actual totex inp'!$L:$L, InpActive!$E144, 'Consolidated actual totex inp'!G:G)","v":0},{"$f":"SUMIF('Consolidated actual totex inp'!$L:$L, InpActive!$E144, 'Consolidated actual totex inp'!H:H)","v":0},{"$f":"SUMIF('Consolidated actual totex inp'!$L:$L, InpActive!$E144, 'Consolidated actual totex inp'!I:I)","v":0},{"$f":"SUMIF('Consolidated actual totex inp'!$L:$L, InpActive!$E144, 'Consolidated actual totex inp'!J:J)","v":0},{"$f":"SUMIF('Consolidated actual totex inp'!$L:$L, InpActive!$E144, 'Consolidated actual totex inp'!K:K)","v":0}]
[null,null,null,"2017/18 CPIH","Allowance for CMA excluded items - WWN - real",null,"£m",null,null,null,{"$f":"SUMIFS('Non-fountain inputs'!C$8:C$23, 'Non-fountain inputs'!$A$8:$A$23, InpActive!$P$1, 'Non-fountain inputs'!$B$8:$B$23, InpActive!$E145)","v":0},{"$f":"SUMIFS('Non-fountain inputs'!D$8:D$23, 'Non-fountain inputs'!$A$8:$A$23, InpActive!$P$1, 'Non-fountain inputs'!$B$8:$B$23, InpActive!$E145)","v":0},{"$f":"SUMIFS('Non-fountain inputs'!E$8:E$23, 'Non-fountain inputs'!$A$8:$A$23, InpActive!$P$1, 'Non-fountain inputs'!$B$8:$B$23, InpActive!$E145)","v":0},{"$f":"SUMIFS('Non-fountain inputs'!F$8:F$23, 'Non-fountain inputs'!$A$8:$A$23, InpActive!$P$1, 'Non-fountain inputs'!$B$8:$B$23, InpActive!$E145)","v":0},{"$f":"SUMIFS('Non-fountain inputs'!G$8:G$23, 'Non-fountain inputs'!$A$8:$A$23, InpActive!$P$1, 'Non-fountain inputs'!$B$8:$B$23, InpActive!$E145)","v":0}]
["PD9_13WWN_PR24",null,null,null,"CMA excluded items sharing rate - WWN - real",0,"%"]
[]
[null,"Bioresources"]
[null,null,null,"Business Rates and Abstraction"]
["C_TBC_WBR_PR19CA008_OFWAT",null,null,"2017/18 CPIH","Base Costs - BIO - Real",114.7,"£m"]
["C_PR19_E_WW_WINEP_BIO",null,null,"2017/18 CPIH","WINEP / NEP ~ In-the-Round - BIO - Real",0,"£m"]
[]
["C_OPEX_SPLIT_BASE_BR_PR19CA091",null,null,null,"Opex Split Profile - Base costs - BIO",null,"%",null,null,null,0.14557448148837213,0.14625672704593445,0.14694921226875687,0.14765209283482697,0.14797801216352618]
["C_CAPEX_SPLIT_BASE_BR_PR19CA091",null,null,null,"Capex Split Profile - Base costs - BIO",null,"%",null,null,null,5.2590708679648983E-2,4.5834751586344945E-2,6.3555294781896726E-2,4.4372806772711854E-2,5.9235912377980968E-2]
[]
["C_UBC_WBR_PR19CA008_OFWAT",null,null,"2017/18 CPIH","Business rates - Forecast - BIO - Real",8.1630133197993793,"£m"]
[]
[null,null,null,"nominal","Business rates - Actual - BIO - Nominal",null,"£m",null,null,null,1.646032582931648,1.6186058685221594,1.6140000000000001,1.877,{"$f":"[2]Workings!$J$48*'[2]PD1 inflation'!$B$6","v":2.1286888643629047}]
[]
[null,null,null,null,"Business Rates forecast profile - BIO",null,"%",null,null,null,0.2,0.2,0.2,0.2,0.2]
[]
[null,null,null,null,"Weighted average PAYG rate - BIO",0.73,"%"]
[]
[null,null,"CMA exclusions"]
[null,null,null,"nominal","Actuals for CMA excluded items - BIO - nominal",null,"£m",null,null,null,0,0,0,0,0]
[null,null,null,"2017/18 CPIH","Allowance for CMA excluded items - BIO - real",null,"£m",null,null,null,0,0,0,0,0]
["PD9_13BIO_PR24",null,null,null,"CMA excluded items sharing rate - BIO - real",0,"%"]
[]
[null,null,"Bonuses"]
[null,null,null,"nominal","Performance related pay recovery mechanism adjustment  - BIO - Nominal (Neg)",null,"£m",null,null,null,0,0,0,0,0]
[]
[]
[null,"Thames Tideway "]
[null,null,"Wage adjustment"]
[null,null,null,"2017/18 CPIH","Base Costs - TTT - Real",null,"£m"]
[]
[null,null,null,null,"Opex Split Profile - Base costs - TTT",null,"%"]
[null,null,null,null,"Capex Split Profile - Base costs - TTT",null,"%"]
[]
[null,null,null,null,"Opex split profile - Cost sharing - TTT",null,"%"]
[null,null,null,null,"Capex split profile - Cost sharing - TTT",null,"%"]
[]
[null,null,"Net totex for cost sharing reconciliation"]
[null,null,null,"nominal","Net totex for cost sharing reconciliation - TTT - nominal",null,"£m"]
[null,null,null,"2017/18 CPIH","Net totex available for cost sharing - TTT - Real",null,"£m"]
[null,null,null,"nominal","Performance related pay recovery mechanism adjustment  - TTT - Nominal (Neg)",null,"£m"]
[]
[null,null,null,"2017/18 CPIH","Total final WINEP reconciliation - TTT - real",null,"£m"]
[]
[null,null,null,null,"Weighted average PAYG rate - TTT",null,"%"]
[]
[]
["GREEN RECOVERY"]
[]
[null,null,"Water Resources"]
[]
[null,null,null,null,"Actual Green Recovery Expenditure - WR - nominal",null,"£m",{"$f":" SUM(K197:O197)","v":0},null,null,{"$f":"SUMIF('Consolidated actual totex inp'!$L$59:$L$79, InpActive!$E197, 'Consolidated actual totex inp'!G$59:G$79)","v":0},{"$f":"SUMIF('Consolidated actual totex inp'!$L$59:$L$79, InpActive!$E197, 'Consolidated actual totex inp'!H$59:H$79)","v":0},{"$f":"SUMIF('Consolidated actual totex inp'!$L$59:$L$79, InpActive!$E197, 'Consolidated actual totex inp'!I$59:I$79)","v":0},{"$f":"SUMIF('Consolidated actual totex inp'!$L$59:$L$79, InpActive!$E197, 'Consolidated actual totex inp'!J$59:J$79)","v":0},{"$f":"SUMIF('Consolidated actual totex inp'!$L$59:$L$79, InpActive!$E197, 'Consolidated actual totex inp'!K$59:K$79)","v":0}]
["C_PR24PD21_01WR_PR24",null,null,null,"Total adjusted cost allowance - WR - real",null,"£m",{"$f":" SUM(K198:O198)","v":0},null,null,{"$f":"SUMIF(F_Inputs!$B:$B, InpActive!$A198, F_Inputs!F:F)","v":0},{"$f":"SUMIF(F_Inputs!$B:$B, InpActive!$A198, F_Inputs!G:G)","v":0},{"$f":"SUMIF(F_Inputs!$B:$B, InpActive!$A198, F_Inputs!H:H)","v":0},{"$f":"SUMIF(F_Inputs!$B:$B, InpActive!$A198, F_Inputs!I:I)","v":0},{"$f":"SUMIF(F_Inputs!$B:$B, InpActive!$A198, F_Inputs!J:J)","v":0}]
[]
[null,null,"Water Network"]
[]
[null,null,null,null,"Actual Green Recovery Expenditure - WN - nominal",null,"£m",{"$f":" SUM(K202:O202)","v":0},null,null,{"$f":"SUMIF('Consolidated actual totex inp'!$L$59:$L$79, InpActive!$E202, 'Consolidated actual totex inp'!G$59:G$79)","v":0},{"$f":"SUMIF('Consolidated actual totex inp'!$L$59:$L$79, InpActive!$E202, 'Consolidated actual totex inp'!H$59:H$79)","v":0},{"$f":"SUMIF('Consolidated actual totex inp'!$L$59:$L$79, InpActive!$E202, 'Consolidated actual totex inp'!I$59:I$79)","v":0},{"$f":"SUMIF('Consolidated actual totex inp'!$L$59:$L$79, InpActive!$E202, 'Consolidated actual totex inp'!J$59:J$79)","v":0},{"$f":"SUMIF('Consolidated actual totex inp'!$L$59:$L$79, InpActive!$E202, 'Consolidated actual totex inp'!K$59:K$79)","v":0}]
["C_PR24PD21_01WN_PR24",null,null,null,"Total adjusted cost allowance - WN - real",null,"£m",{"$f":" SUM(K203:O203)","v":0},null,null,{"$f":"SUMIF(F_Inputs!$B:$B, InpActive!$A203, F_Inputs!F:F)","v":0},{"$f":"SUMIF(F_Inputs!$B:$B, InpActive!$A203, F_Inputs!G:G)","v":0},{"$f":"SUMIF(F_Inputs!$B:$B, InpActive!$A203, F_Inputs!H:H)","v":0},{"$f":"SUMIF(F_Inputs!$B:$B, InpActive!$A203, F_Inputs!I:I)","v":0},{"$f":"SUMIF(F_Inputs!$B:$B, InpActive!$A203, F_Inputs!J:J)","v":0}]
[]
[null,null,"Wastewater Network"]
[]
[null,null,null,null,"Actual Green Recovery Expenditure - WWN - nominal",null,"£m",{"$f":" SUM(K207:O207)","v":0},null,null,{"$f":"SUMIF('Consolidated actual totex inp'!$L$59:$L$79, InpActive!$E207, 'Consolidated actual totex inp'!G$59:G$79)","v":0},{"$f":"SUMIF('Consolidated actual totex inp'!$L$59:$L$79, InpActive!$E207, 'Consolidated actual totex inp'!H$59:H$79)","v":0},{"$f":"SUMIF('Consolidated actual totex inp'!$L$59:$L$79, InpActive!$E207, 'Consolidated actual totex inp'!I$59:I$79)","v":0},{"$f":"SUMIF('Consolidated actual totex inp'!$L$59:$L$79, InpActive!$E207, 'Consolidated actual totex inp'!J$59:J$79)","v":0},{"$f":"SUMIF('Consolidated actual totex inp'!$L$59:$L$79, InpActive!$E207, 'Consolidated actual totex inp'!K$59:K$79)","v":0}]
["C_PR24PD21_01WWN_PR24",null,null,null,"Total adjusted cost allowance - WWN - real",null,"£m",{"$f":" SUM(K208:O208)","v":0},null,null,{"$f":"SUMIF(F_Inputs!$B:$B, InpActive!$A208, F_Inputs!F:F)","v":0},{"$f":"SUMIF(F_Inputs!$B:$B, InpActive!$A208, F_Inputs!G:G)","v":0},{"$f":"SUMIF(F_Inputs!$B:$B, InpActive!$A208, F_Inputs!H:H)","v":0},{"$f":"SUMIF(F_Inputs!$B:$B, InpActive!$A208, F_Inputs!I:I)","v":0},{"$f":"SUMIF(F_Inputs!$B:$B, InpActive!$A208, F_Inputs!J:J)","v":0}]
[]
[]
[null,null,null,"Green Recovery Sharing Rates"]
[null,null,null,null,"Green Recovery Outperformance Rate ",0.1,"%"]
[null,null,null,null,"Green Recovery Underperformance Rate ",0.5,"%"]
[]
["INFLATION"]
[]
[null,null,null,"Base Year"]
[null,null,null,null,"Consumer Price Index (with housing) for April",103.2,"Index"]
[null,null,null,null,"Consumer Price Index (with housing) for May",103.5,"Index"]
[null,null,null,null,"Consumer Price Index (with housing) for June",103.5,"Index"]
[null,null,null,null,"Consumer Price Index (with housing) for July",103.5,"Index"]
[null,null,null,null,"Consumer Price Index (with housing) for August",104,"Index"]
[null,null,null,null,"Consumer Price Index (with housing) for September",104.3,"Index"]
[null,null,null,null,"Consumer Price Index (with housing) for October",104.4,"Index"]
[null,null,null,null,"Consumer Price Index (with housing) for November",104.7,"Index"]
[null,null,null,null,"Consumer Price Index (with housing) for December",105,"Index"]
[null,null,null,null,"Consumer Price Index (with housing) for January",104.5,"Index"]
[null,null,null,null,"Consumer Price Index (with housing) for February",104.9,"Index"]
[null,null,null,null,"Consumer Price Index (with housing) for March",105.1,"Index"]
[]
[null,null,null,"Period"]
[null,null,null,null,"Consumer Price Index (with housing) for April",null,"Index",null,null,107.6,108.6,110.4,119,128.30000000000001,132.19999999999999,135.80000000000001]
[null,null,null,null,"Consumer Price Index (with housing) for May",null,"Index",null,null,107.9,108.6,111,119.7,129.1,132.69999999999999,136.19999999999999]
[null,null,null,null,"Consumer Price Index (with housing) for June",null,"Index",null,null,107.9,108.8,111.4,120.5,129.4,133,136.30000000000001]
[null,null,null,null,"Consumer Price Index (with housing) for July",null,"Index",null,null,108,109.2,111.4,121.2,129,132.69999999999999,136.19999999999999]
[null,null,null,null,"Consumer Price Index (with housing) for August",null,"Index",null,null,108.3,108.8,112.1,121.8,129.4,133.19999999999999,136.69999999999999]
[null,null,null,null,"Consumer Price Index (with housing) for September",null,"Index",null,null,108.4,109.2,112.4,122.3,130.1,133.6,137]
[null,null,null,null,"Consumer Price Index (with housing) for October",null,"Index",null,null,108.3,109.2,113.4,124.3,130.19999999999999,134.19999999999999,137.19999999999999]
[null,null,null,null,"Consumer Price Index (with housing) for November",null,"Index",null,null,108.5,109.1,114.1,124.8,130,134.4,137.4]
[null,null,null,null,"Consumer Price Index (with housing) for December",null,"Index",null,null,108.5,109.4,114.7,125.3,130.5,134.69999999999999,137.69999999999999]
[null,null,null,null,"Consumer Price Index (with housing) for January",null,"Index",null,null,108.3,109.3,114.6,124.8,130,134.1,136.80000000000001]
[null,null,null,null,"Consumer Price Index (with housing) for February",null,"Index",null,null,108.6,109.4,115.4,126,130.80000000000001,134.69999999999999,137.4]
[null,null,null,null,"Consumer Price Index (with housing) for March",null,"Index",null,null,108.6,109.7,116.5,126.8,131.6,135.19999999999999,137.9]
[null,null,null,null,null,null,null,null,null,{"$f":"AVERAGE(J232:J243)","v":108.24166666666663},{"$f":"AVERAGE(K232:K243)","v":109.10833333333335},113.11666666666667,123.04166666666664,129.86666666666665,133.72499999999999]
[null,null,null,null,null,null,null,null,null,null,{"$f":"K244/J244","v":1.0080067749634312},{"$f":"L244/K244","v":1.0367371878102802},1.0877412700751434,1.0554690145614629,1.0297099589322383]
["WAGE GROWTH"]
[]
[null,null,null,"Wage Growth "]
[null,null,null,null,"OBR Forecast wage growth for PR19 FD",null,"%",null,null,0.01,1.0999999999999999E-2,1.0999999999999999E-2,1.2E-2,1.2999999999999999E-2,1.4E-2]
[null,null,null,null,"ASHE Gross Hourly Wage All - Nominal",null,"£ / hour",null,null,{"$f":"[4]Analysis!D15","v":17.059999999999999},{"$f":"[4]Analysis!E15","v":17.54},{"$f":"[4]Analysis!F15","v":18.14},{"$f":"[4]Analysis!G15","v":19.600000000000001},{"$f":"[4]Analysis!H15","v":20.88990579184928},{"$f":"[4]Analysis!I15","v":21.672334512988002}]
[]
[null,null,null,"Percentage totex linked to wage growth"]
[null,null,null,null,"Percentage totex linked to wage growth - WR",0.38600000000000001,"%"]
[]
[null,null,null,null,"Percentage totex linked to wage growth - WN",0.38600000000000001,"%"]
[]
[null,null,null,null,"Percentage totex linked to wage growth - WWN",0.38600000000000001,"%"]
[]
[null,null,null,null,"Percentage totex linked to wage growth - BIO",0.38600000000000001,"%"]
[]
[null,null,null,null,"Percentage totex linked to wage growth - TTT",0.38600000000000001,"%"]
[]
[]
["COST SHARING INPUTS"]
[]
[null,null,null,"Totex cost sharing rates"]
["C_WR_WN_OUTPERFORM_001",null,null,null,"Outperformance Rate - WR",0.43863536681180526,"%"]
["C_WR_WN_UNDERPERFORM_001",null,null,null,"Underperformance Rate - WR",0.56136463318819474,"%"]
[]
["C_WR_WN_OUTPERFORM_001",null,null,null,"Outperformance Rate - WN",0.43863536681180526,"%"]
["C_WR_WN_UNDERPERFORM_001",null,null,null,"Underperformance Rate - WN",0.56136463318819474,"%"]
[]
["C_WWN_OUTPERFORM_001",null,null,null,"Outperformance Rate - WWN",0.41328584010084235,"%"]
["C_WWN_UNDERPERFORM_001",null,null,null,"Underperformance Rate - WWN",0.58671415989915765,"%"]
[]
[null,null,null,null,"Outperformance Rate - TTT",0,"%"]
[null,null,null,null,"Underperformance Rate - TTT",0,"%"]
[]
[null,null,null,"Abstraction and Business rate cost sharing rates"]
[null,null,null,null,"Cost sharing rates Business rates - Overperformance",0.25,"%"]
[null,null,null,null,"Cost sharing rates Business rates - Underperformance",0.25,"%"]
[null,null,null,null,"Cost sharing rates Abstraction - Overperformance",0.25,"%"]
[null,null,null,null,"Cost sharing rates Abstraction - Underperformance",0.25,"%"]
[]
["FINANCING INPUTS"]
[]
[null,"Model Tolerance"]
[null,null,null,null,"Financing cost index",null,"Index",null,null,null,4,3,2,1,0]
[]
[null,null,null,null,"Real WACC CPIH Deflated - WR",2.92E-2,"%"]
[null,null,null,null,"Real WACC CPIH Deflated - WN",2.92E-2,"%"]
[null,null,null,null,"Real WACC CPIH Deflated - WWN",2.92E-2,"%"]
[null,null,null,null,"Real WACC CPIH Deflated - BIO",2.92E-2,"%"]
[null,null,null,null,"Real WACC CPIH Deflated - TTT",0,"%"]
[]
["NON CHANGEABLE INPUTS"]
[]
[null,"Model Tolerance"]
[null,null,null,null,"Model Check Tolerance Level",1E-4,"tolerance"]
[]
[null,null,null,null,"Model Track Tolerance Level",1E-3,"tolerance"]
[]
["END OF SHEET"]

{"sheet":"Calc-->","index":10,"n_rows":0,"n_cols":0,"rows_kept":0,"cut":false,"hidden":false,"merged":[]}

{"sheet":"Index","index":11,"n_rows":45,"n_cols":16,"rows_kept":45,"cut":false,"hidden":false,"merged":[]}
[{"$f":" RIGHT(CELL(\"filename\", $A$1), LEN(CELL(\"filename\", $A$1)) - SEARCH(\"]\", CELL(\"filename\", $A$1)))","v":{"$error":"#VALUE!"}}]
[null,null,null,null,{"$f":"Time!E$22","v":"Model Period BEG"},null,null,null,null,{"$f":"Time!J$22","v":"2019-04-01"},{"$f":"Time!K$22","v":"2020-04-01"},{"$f":"Time!L$22","v":"2021-04-01"},{"$f":"Time!M$22","v":"2022-04-01"},{"$f":"Time!N$22","v":"2023-04-01"},{"$f":"Time!O$22","v":"2024-04-01"},{"$f":"Time!P$22","v":"2025-04-01"}]
[null,null,null,null,{"$f":"Time!E$23","v":"Model Period END"},{"$f":"Check!F$8","v":0},"Error chks",null,null,{"$f":"Time!J$23","v":"2020-03-31"},{"$f":"Time!K$23","v":"2021-03-31"},{"$f":"Time!L$23","v":"2022-03-31"},{"$f":"Time!M$23","v":"2023-03-31"},{"$f":"Time!N$23","v":"2024-03-31"},{"$f":"Time!O$23","v":"2025-03-31"},{"$f":"Time!P$23","v":"2026-03-31"}]
[null,null,null,null,{"$f":"Time!E$59","v":"Pre Forecast vs Forecast"},null,null,null,null,{"$f":"Time!J$59","v":"Pre Fcst"},{"$f":"Time!K$59","v":"Forecast"},{"$f":"Time!L$59","v":"Forecast"},{"$f":"Time!M$59","v":"Forecast"},{"$f":"Time!N$59","v":"Forecast"},{"$f":"Time!O$59","v":"Forecast"},{"$f":"Time!P$59","v":"Post-Fcst"}]
[null,null,null,null,{"$f":"Time!E$101","v":"Financial Year Ending"},null,null,null,null,{"$f":"Time!J$101","v":2020},{"$f":"Time!K$101","v":2021},{"$f":"Time!L$101","v":2022},{"$f":"Time!M$101","v":2023},{"$f":"Time!N$101","v":2024},{"$f":"Time!O$101","v":2025},{"$f":"Time!P$101","v":2026}]
[null,null,null,null,{"$f":"Time!E$11","v":"Model column counter"},"Constant","Unit","Total",null,{"$f":"Time!J$11","v":1},{"$f":"Time!K$11","v":2},{"$f":"Time!L$11","v":3},{"$f":"Time!M$11","v":4},{"$f":"Time!N$11","v":5},{"$f":"Time!O$11","v":6},{"$f":"Time!P$11","v":7}]
[]
["CPI(H) INDEXATION"]
[]
[null,null,"Average CPI(H) - base index"]
[null,null,null,null,{"$f":" InpActive!E218","v":"Consumer Price Index (with housing) for April"},{"$f":" InpActive!F218","v":103.2},{"$f":" InpActive!G218","v":"Index"}]
[null,null,null,null,{"$f":" InpActive!E219","v":"Consumer Price Index (with housing) for May"},{"$f":" InpActive!F219","v":103.5},{"$f":" InpActive!G219","v":"Index"}]
[null,null,null,null,{"$f":" InpActive!E220","v":"Consumer Price Index (with housing) for June"},{"$f":" InpActive!F220","v":103.5},{"$f":" InpActive!G220","v":"Index"}]
[null,null,null,null,{"$f":" InpActive!E221","v":"Consumer Price Index (with housing) for July"},{"$f":" InpActive!F221","v":103.5},{"$f":" InpActive!G221","v":"Index"}]
[null,null,null,null,{"$f":" InpActive!E222","v":"Consumer Price Index (with housing) for August"},{"$f":" InpActive!F222","v":104},{"$f":" InpActive!G222","v":"Index"}]
[null,null,null,null,{"$f":" InpActive!E223","v":"Consumer Price Index (with housing) for September"},{"$f":" InpActive!F223","v":104.3},{"$f":" InpActive!G223","v":"Index"}]
[null,null,null,null,{"$f":" InpActive!E224","v":"Consumer Price Index (with housing) for October"},{"$f":" InpActive!F224","v":104.4},{"$f":" InpActive!G224","v":"Index"}]
[null,null,null,null,{"$f":" InpActive!E225","v":"Consumer Price Index (with housing) for November"},{"$f":" InpActive!F225","v":104.7},{"$f":" InpActive!G225","v":"Index"}]
[null,null,null,null,{"$f":" InpActive!E226","v":"Consumer Price Index (with housing) for December"},{"$f":" InpActive!F226","v":105},{"$f":" InpActive!G226","v":"Index"}]
[null,null,null,null,{"$f":" InpActive!E227","v":"Consumer Price Index (with housing) for January"},{"$f":" InpActive!F227","v":104.5},{"$f":" InpActive!G227","v":"Index"}]
[null,null,null,null,{"$f":" InpActive!E228","v":"Consumer Price Index (with housing) for February"},{"$f":" InpActive!F228","v":104.9},{"$f":" InpActive!G228","v":"Index"}]
[null,null,null,null,{"$f":" InpActive!E229","v":"Consumer Price Index (with housing) for March"},{"$f":" InpActive!F229","v":105.1},{"$f":" InpActive!G229","v":"Index"}]
[null,null,null,null,"CPIH 2017/18 FYA - Base Year",{"$f":" AVERAGE(F11:F22)","v":104.21666666666665},"Index"]
[]
[null,null,"CPI(H): Financial year average - index"]
[null,null,null,null,{"$f":" InpActive!E232","v":"Consumer Price Index (with housing) for April"},{"$f":" InpActive!F232","v":0},{"$f":" InpActive!G232","v":"Index"},{"$f":" InpActive!H232","v":0},{"$f":" InpActive!I232","v":0},{"$f":" InpActive!J232","v":107.6},{"$f":" InpActive!K232","v":108.6},{"$f":" InpActive!L232","v":110.4},{"$f":" InpActive!M232","v":119},{"$f":" InpActive!N232","v":128.30000000000001},{"$f":" InpActive!O232","v":132.19999999999999},{"$f":" InpActive!P232","v":135.80000000000001}]
[null,null,null,null,{"$f":" InpActive!E233","v":"Consumer Price Index (with housing) for May"},{"$f":" InpActive!F233","v":0},{"$f":" InpActive!G233","v":"Index"},{"$f":" InpActive!H233","v":0},{"$f":" InpActive!I233","v":0},{"$f":" InpActive!J233","v":107.9},{"$f":" InpActive!K233","v":108.6},{"$f":" InpActive!L233","v":111},{"$f":" InpActive!M233","v":119.7},{"$f":" InpActive!N233","v":129.1},{"$f":" InpActive!O233","v":132.69999999999999},{"$f":" InpActive!P233","v":136.19999999999999}]
[null,null,null,null,{"$f":" InpActive!E234","v":"Consumer Price Index (with housing) for June"},{"$f":" InpActive!F234","v":0},{"$f":" InpActive!G234","v":"Index"},{"$f":" InpActive!H234","v":0},{"$f":" InpActive!I234","v":0},{"$f":" InpActive!J234","v":107.9},{"$f":" InpActive!K234","v":108.8},{"$f":" InpActive!L234","v":111.4},{"$f":" InpActive!M234","v":120.5},{"$f":" InpActive!N234","v":129.4},{"$f":" InpActive!O234","v":133},{"$f":" InpActive!P234","v":136.30000000000001}]
[null,null,null,null,{"$f":" InpActive!E235","v":"Consumer Price Index (with housing) for July"},{"$f":" InpActive!F235","v":0},{"$f":" InpActive!G235","v":"Index"},{"$f":" InpActive!H235","v":0},{"$f":" InpActive!I235","v":0},{"$f":" InpActive!J235","v":108},{"$f":" InpActive!K235","v":109.2},{"$f":" InpActive!L235","v":111.4},{"$f":" InpActive!M235","v":121.2},{"$f":" InpActive!N235","v":129},{"$f":" InpActive!O235","v":132.69999999999999},{"$f":" InpActive!P235","v":136.19999999999999}]
[null,null,null,null,{"$f":" InpActive!E236","v":"Consumer Price Index (with housing) for August"},{"$f":" InpActive!F236","v":0},{"$f":" InpActive!G236","v":"Index"},{"$f":" InpActive!H236","v":0},{"$f":" InpActive!I236","v":0},{"$f":" InpActive!J236","v":108.3},{"$f":" InpActive!K236","v":108.8},{"$f":" InpActive!L236","v":112.1},{"$f":" InpActive!M236","v":121.8},{"$f":" InpActive!N236","v":129.4},{"$f":" InpActive!O236","v":133.19999999999999},{"$f":" InpActive!P236","v":136.69999999999999}]
[null,null,null,null,{"$f":" InpActive!E237","v":"Consumer Price Index (with housing) for September"},{"$f":" InpActive!F237","v":0},{"$f":" InpActive!G237","v":"Index"},{"$f":" InpActive!H237","v":0},{"$f":" InpActive!I237","v":0},{"$f":" InpActive!J237","v":108.4},{"$f":" InpActive!K237","v":109.2},{"$f":" InpActive!L237","v":112.4},{"$f":" InpActive!M237","v":122.3},{"$f":" InpActive!N237","v":130.1},{"$f":" InpActive!O237","v":133.6},{"$f":" InpActive!P237","v":137}]
[null,null,null,null,{"$f":" InpActive!E238","v":"Consumer Price Index (with housing) for October"},{"$f":" InpActive!F238","v":0},{"$f":" InpActive!G238","v":"Index"},{"$f":" InpActive!H238","v":0},{"$f":" InpActive!I238","v":0},{"$f":" InpActive!J238","v":108.3},{"$f":" InpActive!K238","v":109.2},{"$f":" InpActive!L238","v":113.4},{"$f":" InpActive!M238","v":124.3},{"$f":" InpActive!N238","v":130.19999999999999},{"$f":" InpActive!O238","v":134.19999999999999},{"$f":" InpActive!P238","v":137.19999999999999}]
[null,null,null,null,{"$f":" InpActive!E239","v":"Consumer Price Index (with housing) for November"},{"$f":" InpActive!F239","v":0},{"$f":" InpActive!G239","v":"Index"},{"$f":" InpActive!H239","v":0},{"$f":" InpActive!I239","v":0},{"$f":" InpActive!J239","v":108.5},{"$f":" InpActive!K239","v":109.1},{"$f":" InpActive!L239","v":114.1},{"$f":" InpActive!M239","v":124.8},{"$f":" InpActive!N239","v":130},{"$f":" InpActive!O239","v":134.4},{"$f":" InpActive!P239","v":137.4}]
[null,null,null,null,{"$f":" InpActive!E240","v":"Consumer Price Index (with housing) for December"},{"$f":" InpActive!F240","v":0},{"$f":" InpActive!G240","v":"Index"},{"$f":" InpActive!H240","v":0},{"$f":" InpActive!I240","v":0},{"$f":" InpActive!J240","v":108.5},{"$f":" InpActive!K240","v":109.4},{"$f":" InpActive!L240","v":114.7},{"$f":" InpActive!M240","v":125.3},{"$f":" InpActive!N240","v":130.5},{"$f":" InpActive!O240","v":134.69999999999999},{"$f":" InpActive!P240","v":137.69999999999999}]
[null,null,null,null,{"$f":" InpActive!E241","v":"Consumer Price Index (with housing) for January"},{"$f":" InpActive!F241","v":0},{"$f":" InpActive!G241","v":"Index"},{"$f":" InpActive!H241","v":0},{"$f":" InpActive!I241","v":0},{"$f":" InpActive!J241","v":108.3},{"$f":" InpActive!K241","v":109.3},{"$f":" InpActive!L241","v":114.6},{"$f":" InpActive!M241","v":124.8},{"$f":" InpActive!N241","v":130},{"$f":" InpActive!O241","v":134.1},{"$f":" InpActive!P241","v":136.80000000000001}]
[null,null,null,null,{"$f":" InpActive!E242","v":"Consumer Price Index (with housing) for February"},{"$f":" InpActive!F242","v":0},{"$f":" InpActive!G242","v":"Index"},{"$f":" InpActive!H242","v":0},{"$f":" InpActive!I242","v":0},{"$f":" InpActive!J242","v":108.6},{"$f":" InpActive!K242","v":109.4},{"$f":" InpActive!L242","v":115.4},{"$f":" InpActive!M242","v":126},{"$f":" InpActive!N242","v":130.80000000000001},{"$f":" InpActive!O242","v":134.69999999999999},{"$f":" InpActive!P242","v":137.4}]
[null,null,null,null,{"$f":" InpActive!E243","v":"Consumer Price Index (with housing) for March"},{"$f":" InpActive!F243","v":0},{"$f":" InpActive!G243","v":"Index"},{"$f":" InpActive!H243","v":0},{"$f":" InpActive!I243","v":0},{"$f":" InpActive!J243","v":108.6},{"$f":" InpActive!K243","v":109.7},{"$f":" InpActive!L243","v":116.5},{"$f":" InpActive!M243","v":126.8},{"$f":" InpActive!N243","v":131.6},{"$f":" InpActive!O243","v":135.19999999999999},{"$f":" InpActive!P243","v":137.9}]
[null,null,null,null,"CPIH 2017/18 FYA - Period",null,"Index",null,null,{"$f":" AVERAGE(J26:J37)","v":108.24166666666663},{"$f":" AVERAGE(K26:K37)","v":109.10833333333335},113.11666666666667,123.04166666666664,129.86666666666665,133.72499999999999,136.88333333333335]
[]
[null,null,null,"CPI(H): Fin year average - inflate from base year average"]
[null,null,null,null,{"$f":" E$23","v":"CPIH 2017/18 FYA - Base Year"},{"$f":" F$23","v":104.21666666666665},"Index"]
[null,null,null,null,{"$f":" E$38","v":"CPIH 2017/18 FYA - Period"},{"$f":" F$38","v":0},"Index",0,0,108.24166666666663,109.10833333333335,113.11666666666667,123.04166666666664,129.86666666666665,133.72499999999999,136.88333333333335]
[null,null,null,null,"CPI(H): Fin year average - inflate from base year 2017-18 average - CALC",null,"%",null,null,{"$f":" IF($F41 = 0, 0, J42 / $F41)","v":1.0386214616983847},{"$f":" IF($F41 = 0, 0, K42 / $F41)","v":1.0469374700143934},{"$f":" IF($F41 = 0, 0, L42 / $F41)","v":1.0853990084759317},1.1806332960179113,1.2461218615064769,1.2831440908363987,1.3134495442187752]
[]
["END OF SHEET"]

{"sheet":"Time","index":12,"n_rows":104,"n_cols":16,"rows_kept":104,"cut":false,"hidden":false,"merged":[]}
[{"$f":" RIGHT(CELL(\"filename\", $A$1), LEN(CELL(\"filename\", $A$1)) - SEARCH(\"]\", CELL(\"filename\", $A$1)))","v":{"$error":"#VALUE!"}}]
[null,null,null,null,{"$f":"Time!E$22","v":"Model Period BEG"},null,null,null,null,{"$f":"Time!J$22","v":"2019-04-01"},{"$f":"Time!K$22","v":"2020-04-01"},{"$f":"Time!L$22","v":"2021-04-01"},{"$f":"Time!M$22","v":"2022-04-01"},{"$f":"Time!N$22","v":"2023-04-01"},{"$f":"Time!O$22","v":"2024-04-01"},{"$f":"Time!P$22","v":"2025-04-01"}]
[null,null,null,null,{"$f":"Time!E$23","v":"Model Period END"},{"$f":"Check!F$8","v":0},"Error chks",null,null,{"$f":"Time!J$23","v":"2020-03-31"},{"$f":"Time!K$23","v":"2021-03-31"},{"$f":"Time!L$23","v":"2022-03-31"},{"$f":"Time!M$23","v":"2023-03-31"},{"$f":"Time!N$23","v":"2024-03-31"},{"$f":"Time!O$23","v":"2025-03-31"},{"$f":"Time!P$23","v":"2026-03-31"}]
[null,null,null,null,{"$f":"Time!E$59","v":"Pre Forecast vs Forecast"},null,null,null,null,{"$f":"Time!J$59","v":"Pre Fcst"},{"$f":"Time!K$59","v":"Forecast"},{"$f":"Time!L$59","v":"Forecast"},{"$f":"Time!M$59","v":"Forecast"},{"$f":"Time!N$59","v":"Forecast"},{"$f":"Time!O$59","v":"Forecast"},{"$f":"Time!P$59","v":"Post-Fcst"}]
[null,null,null,null,{"$f":"Time!E$101","v":"Financial Year Ending"},null,null,null,null,{"$f":"Time!J$101","v":2020},{"$f":"Time!K$101","v":2021},{"$f":"Time!L$101","v":2022},{"$f":"Time!M$101","v":2023},{"$f":"Time!N$101","v":2024},{"$f":"Time!O$101","v":2025},{"$f":"Time!P$101","v":2026}]
[null,null,null,null,{"$f":"Time!E$11","v":"Model column counter"},"Constant","Unit","Total",null,{"$f":"Time!J$11","v":1},{"$f":"Time!K$11","v":2},{"$f":"Time!L$11","v":3},{"$f":"Time!M$11","v":4},{"$f":"Time!N$11","v":5},{"$f":"Time!O$11","v":6},{"$f":"Time!P$11","v":7}]
[]
["MODEL PERIOD"]
[]
[null,"Model Column Counter "]
[null,null,null,null,"Model column counter",null,"counter",null,null,{"$f":" I11 + 1","v":1},{"$f":" J11 + 1","v":2},{"$f":" K11 + 1","v":3},4,5,6,{"$f":" O11 + 1","v":7}]
[null,null,null,null,"Model Column Total",{"$f":" MAX(J11:P11)","v":7},"column"]
[]
[null,null,null,null,{"$f":" E$11","v":"Model column counter"},0,"counter",0,0,1,2,3,4,5,6,7]
[null,null,null,null,"First model column flag",null,"flag",{"$f":" SUM(J15:P15)","v":1},null,{"$f":" IF( J14 = 1, 1, 0)","v":1},{"$f":" IF( K14 = 1, 1, 0)","v":0},0,0,0,0,0]
[]
[null,null,null,null,{"$f":" InpActive!E$10","v":"First date of time ruler"},{"$f":" InpActive!F$10","v":"2019-04-01"},{"$f":" InpActive!G$10","v":"date"}]
[null,null,null,null,"First model period BEG",{"$f":" DATE(YEAR(F17), MONTH(F17), 1)","v":"2019-04-01"},"month"]
[]
[null,null,null,null,{"$f":" E$18","v":"First model period BEG"},{"$f":" F$18","v":"2019-04-01"},{"$f":" G$18","v":"month"}]
[null,null,null,null,{"$f":" E$15","v":"First model column flag"},0,"flag",1,0,1,0,0,0,0,0,0]
[null,null,null,null,"Model Period BEG",null,"date",null,null,{"$f":" IF( J21 = 1, $F20, I23 + 1)","v":"2019-04-01"},{"$f":" IF( K21 = 1, $F20, J23 + 1)","v":"2020-04-01"},"2021-04-01","2022-04-01","2023-04-01","2024-04-01",{"$f":" IF( P21 = 1, $F20, O23 + 1)","v":"2025-04-01"}]
[null,null,null,null,"Model Period END",null,"date",null,null,{"$f":" DATE(YEAR(J22), MONTH(J22) + 12, DAY(1) - 1)","v":"2020-03-31"},"2021-03-31","2022-03-31","2023-03-31","2024-03-31","2025-03-31","2026-03-31"]
[]
[null,null,null,null,{"$f":" E$23","v":"Model Period END"},"00:00:00","date","00:00:00","00:00:00","2020-03-31","2021-03-31","2022-03-31","2023-03-31","2024-03-31","2025-03-31","2026-03-31"]
[null,null,null,"less",{"$f":" E$22","v":"Model Period BEG"},"00:00:00","date","00:00:00","00:00:00","2019-04-01","2020-04-01","2021-04-01","2022-04-01","2023-04-01","2024-04-01","2025-04-01"]
[null,null,null,null,"Days in Model Period",null,"days",{"$f":" SUM(J27:P27)","v":2557},null,{"$f":" J25 - J26 + 1","v":366},365,365,365,366,365,365]
[]
[]
["PRE FORECAST PERIOD"]
[]
[null,null,null,null,{"$f":" InpActive!E$12","v":"Last Pre Forecast Date"},{"$f":" InpActive!F$12","v":"2020-03-31"},{"$f":" InpActive!G$12","v":"date"}]
[null,null,null,null,{"$f":" E$23","v":"Model Period END"},"00:00:00","date","00:00:00","00:00:00","2020-03-31","2021-03-31","2022-03-31","2023-03-31","2024-03-31","2025-03-31","2026-03-31"]
[null,null,null,null,"Last Pre Forecast Flag",null,"flag",{"$f":" SUM(J34:P34)","v":1},null,{"$f":" IF(J33 = $F32, 1, 0)","v":1},0,0,0,0,0,0]
[null,null,null,null,"Pre Forecast Period Flag",null,"flag",{"$f":" SUM(J35:P35)","v":1},null,{"$f":" IF($F32 >= J33, 1, 0)","v":1},{"$f":" IF($F32 >= K33, 1, 0)","v":0},0,0,0,0,0]
[null,null,null,null,"Pre Forecast Period Total",{"$f":" SUM(J35:P35)","v":1},"columns"]
[]
[null,null,null,null,{"$f":" InpActive!E$14","v":"Acquisition date (midnight)"},{"$f":" InpActive!F$14","v":"2020-03-31"},{"$f":" InpActive!G$14","v":"date"}]
[null,null,null,null,{"$f":" E$23","v":"Model Period END"},"00:00:00","date","00:00:00","00:00:00","2020-03-31","2021-03-31","2022-03-31","2023-03-31","2024-03-31","2025-03-31","2026-03-31"]
[null,null,null,null,"Acquisition / initial balance date flag",null,"flag",{"$f":" SUM(J40:P40)","v":1},null,{"$f":" IF(J39 = $F38, 1, 0)","v":1},0,0,0,0,0,0]
[]
[]
["FORECAST PERIOD"]
[]
[null,null,null,null,{"$f":" E$34","v":"Last Pre Forecast Flag"},0,"flag",1,0,1,0,0,0,0,0,0]
[null,null,null,null,"1st Forecast Period Flag",null,"flag",{"$f":" SUM(J46:P46)","v":1},null,{"$f":" I45","v":0},{"$f":" J45","v":1},0,0,0,0,{"$f":" O45","v":0}]
[]
[null,null,null,null,{"$f":"InpActive!E$16","v":"Last forecast date"},{"$f":"InpActive!F$16","v":"2025-03-31"},{"$f":"InpActive!G$16","v":"date"}]
[null,null,null,null,{"$f":" E$23","v":"Model Period END"},"00:00:00","date","00:00:00","00:00:00","2020-03-31","2021-03-31","2022-03-31","2023-03-31","2024-03-31","2025-03-31","2026-03-31"]
[null,null,null,null,"Last Forecast Period Flag",null,"flag",{"$f":" SUM(J50:P50)","v":1},null,{"$f":" IF(AND($F48 > I49, $F48 <= J49), 1, 0)","v":0},{"$f":" IF(AND($F48 > J49, $F48 <= K49), 1, 0)","v":0},0,0,0,1,{"$f":" IF(AND($F48 > O49, $F48 <= P49), 1, 0)","v":0}]
[]
[null,null,null,null,{"$f":" E$46","v":"1st Forecast Period Flag"},0,"flag",1,0,0,1,0,0,0,0,0]
[null,null,null,null,{"$f":" E$50","v":"Last Forecast Period Flag"},0,"flag",1,0,0,0,0,0,0,1,0]
[null,null,null,null,"Forecast Period Flag",null,"flag",{"$f":" SUM(J54:P54)","v":5},null,{"$f":" J52 - I53 + I54","v":0},{"$f":" K52 - J53 + J54","v":1},1,1,1,1,{"$f":" P52 - O53 + O54","v":0}]
[null,null,null,null,"Forecast Period Total ",{"$f":" SUM(J54:P54)","v":5},"columns"]
[]
[null,null,null,null,{"$f":" E$35","v":"Pre Forecast Period Flag"},0,"flag",1,0,1,0,0,0,0,0,0]
[null,null,null,null,{"$f":" E$54","v":"Forecast Period Flag"},0,"flag",5,0,0,1,1,1,1,1,0]
[null,null,null,null,"Pre Forecast vs Forecast",null,"flag",null,null,{"$f":" IF(J57 = 1, \"Pre Fcst\", IF(J58 = 1, \"Forecast\", \"Post-Fcst\"))","v":"Pre Fcst"},"Forecast","Forecast","Forecast","Forecast","Forecast","Post-Fcst"]
[]
[]
["POST FORECAST PERIOD"]
[]
[null,null,null,null,{"$f":" E$50","v":"Last Forecast Period Flag"},0,"flag",1,0,0,0,0,0,0,1,0]
[null,null,null,null,"1st Post Last Forecast Period Flag",null,"flag",{"$f":" SUM(J65:P65)","v":1},null,{"$f":" I64","v":0},{"$f":" J64","v":0},0,0,0,0,{"$f":" O64","v":1}]
[]
[null,null,null,null,{"$f":" E$65","v":"1st Post Last Forecast Period Flag"},0,"flag",1,0,0,0,0,0,0,0,1]
[null,null,null,null,"Post Forecast Period Flag",null,"flag",{"$f":" SUM(J68:P68)","v":1},null,{"$f":" I68 + J67","v":0},{"$f":" J68 + K67","v":0},0,0,0,0,{"$f":" O68 + P67","v":1}]
[null,null,null,null,"Post Forecast Period Total",{"$f":" SUM(J68:P68)","v":1},"columns"]
[]
[]
["MODELLING PERIOD CHECK"]
[]
[null,null,null,null,{"$f":" E$12","v":"Model Column Total"},{"$f":" F$12","v":7},{"$f":" G$12","v":"column"}]
[null,null,null,"less",{"$f":" E$36","v":"Pre Forecast Period Total"},{"$f":" F$36","v":1},{"$f":" G$36","v":"columns"}]
[null,null,null,"less",{"$f":" E$55","v":"Forecast Period Total "},{"$f":" F$55","v":5},{"$f":" G$55","v":"columns"}]
[null,null,null,"less",{"$f":" E$69","v":"Post Forecast Period Total"},{"$f":" F$69","v":1},{"$f":" G$69","v":"columns"}]
[null,null,null,null,"Modelling Period Check",{"$f":" IF(F74 - SUM(F75:F77) <> 0, 1, 0)","v":0},"check"]
[]
[]
["PARTIAL PERIOD FLAG (PPF)"]
[null,null,"This is an example of a part period flag. It is not currently used."]
[null,"Operation Partial Period Flag (PPF)"]
[null,null,null,null,{"$f":" E$18","v":"First model period BEG"},{"$f":" F$18","v":"2019-04-01"},{"$f":" G$18","v":"month"}]
[null,null,null,null,{"$f":"InpActive!E$20","v":"Operation Finish Date (midnight)"},{"$f":"InpActive!F$20","v":"2025-03-31"},{"$f":"InpActive!G$20","v":"date"}]
[null,null,null,null,{"$f":" E$22","v":"Model Period BEG"},"00:00:00","date","00:00:00","00:00:00","2019-04-01","2020-04-01","2021-04-01","2022-04-01","2023-04-01","2024-04-01","2025-04-01"]
[null,null,null,null,{"$f":" E$23","v":"Model Period END"},"00:00:00","date","00:00:00","00:00:00","2020-03-31","2021-03-31","2022-03-31","2023-03-31","2024-03-31","2025-03-31","2026-03-31"]
[null,null,null,null,"Days in Operation Period",null,"days",{"$f":" SUM(J88:P88)","v":2192},null,{"$f":" MAX(0, (MIN($F85, J87) - MAX($F84, J86) + 1))","v":366},365,365,365,366,365,0]
[]
[null,null,null,null,{"$f":" E$88","v":"Days in Operation Period"},0,"days",2192,0,366,365,365,365,366,365,0]
[null,null,null,null,{"$f":" E$27","v":"Days in Model Period"},0,"days",2557,0,366,365,365,365,366,365,365]
[null,null,null,null,"Operation Period PPF",null,"factor",{"$f":" SUM(J92:P92)","v":6},null,{"$f":" J90 / J91","v":1},1,1,1,1,1,0]
[]
[]
["FINANCIAL YEAR"]
[]
[null,null,null,null,{"$f":"InpActive!E21","v":"First Modelling Column Financial Year Number"},{"$f":"InpActive!F21","v":2020},{"$f":"InpActive!G21","v":"year"}]
[null,null,null,null,{"$f":"InpActive!E22","v":"Financial Year End Month Number"},{"$f":"InpActive!F22","v":3},{"$f":"InpActive!G22","v":"month #"}]
[null,null,null,null,{"$f":" E$23","v":"Model Period END"},"00:00:00","date","00:00:00","00:00:00","2020-03-31","2021-03-31","2022-03-31","2023-03-31","2024-03-31","2025-03-31","2026-03-31"]
[null,null,null,null,{"$f":" E$15","v":"First model column flag"},0,"flag",1,0,1,0,0,0,0,0,0]
[null,null,null,null,"Financial Year Ending",null,"year #",null,null,{"$f":" IF(J100 = 1, $F97, IF(J99 > (DATE(I101, $F98 + 1, 1) - 1), I101 + 1, I101))","v":2020},{"$f":" IF(K100 = 1, $F97, IF(K99 > (DATE(J101, $F98 + 1, 1) - 1), J101 + 1, J101))","v":2021},2022,2023,2024,2025,{"$f":" IF(P100 = 1, $F97, IF(P99 > (DATE(O101, $F98 + 1, 1) - 1), O101 + 1, O101))","v":2026}]
[]
[]
["END OF SHEET"]

{"sheet":"Cost sharing calculations","index":13,"n_rows":567,"n_cols":16384,"rows_kept":567,"cut":false,"hidden":false,"merged":[]}
[{"$f":" RIGHT(CELL(\"filename\", $A$1), LEN(CELL(\"filename\", $A$1)) - SEARCH(\"]\", CELL(\"filename\", $A$1)))","v":{"$error":"#VALUE!"}}]
[null,null,null,null,{"$f":"Time!E$22","v":"Model Period BEG"},null,null,null,null,{"$f":"Time!J$22","v":"2019-04-01"},{"$f":"Time!K$22","v":"2020-04-01"},{"$f":"Time!L$22","v":"2021-04-01"},{"$f":"Time!M$22","v":"2022-04-01"},{"$f":"Time!N$22","v":"2023-04-01"},{"$f":"Time!O$22","v":"2024-04-01"},{"$f":"Time!P$22","v":"2025-04-01"}]
[null,null,null,null,{"$f":"Time!E$23","v":"Model Period END"},{"$f":"Check!F$8","v":0},"Error chks",null,null,{"$f":"Time!J$23","v":"2020-03-31"},{"$f":"Time!K$23","v":"2021-03-31"},{"$f":"Time!L$23","v":"2022-03-31"},{"$f":"Time!M$23","v":"2023-03-31"},{"$f":"Time!N$23","v":"2024-03-31"},{"$f":"Time!O$23","v":"2025-03-31"},{"$f":"Time!P$23","v":"2026-03-31"}]
[null,null,null,null,{"$f":"Time!E$59","v":"Pre Forecast vs Forecast"},null,null,null,null,{"$f":"Time!J$59","v":"Pre Fcst"},{"$f":"Time!K$59","v":"Forecast"},{"$f":"Time!L$59","v":"Forecast"},{"$f":"Time!M$59","v":"Forecast"},{"$f":"Time!N$59","v":"Forecast"},{"$f":"Time!O$59","v":"Forecast"},{"$f":"Time!P$59","v":"Post-Fcst"}]
[null,null,null,null,{"$f":"Time!E$101","v":"Financial Year Ending"},null,null,null,null,{"$f":"Time!J$101","v":2020},{"$f":"Time!K$101","v":2021},{"$f":"Time!L$101","v":2022},{"$f":"Time!M$101","v":2023},{"$f":"Time!N$101","v":2024},{"$f":"Time!O$101","v":2025},{"$f":"Time!P$101","v":2026}]
[null,null,null,null,{"$f":"Time!E$11","v":"Model column counter"},"Constant","Unit","Total",null,{"$f":"Time!J$11","v":1},{"$f":"Time!K$11","v":2},{"$f":"Time!L$11","v":3},{"$f":"Time!M$11","v":4},{"$f":"Time!N$11","v":5},{"$f":"Time!O$11","v":6},{"$f":"Time!P$11","v":7}]
[]
["WAGE GROWTH ADJUSTER"]
[]
[null,null,"Cumulative actual real wage growth"]
[null,null,null,null,{"$f":"InpActive!E250","v":"ASHE Gross Hourly Wage All - Nominal"},{"$f":"InpActive!F250","v":0},{"$f":"InpActive!G250","v":"£ / hour"},{"$f":"InpActive!H250","v":0},{"$f":"InpActive!I250","v":0},{"$f":"InpActive!J250","v":17.059999999999999},{"$f":"InpActive!K250","v":17.54},{"$f":"InpActive!L250","v":18.14},{"$f":"InpActive!M250","v":19.600000000000001},{"$f":"InpActive!N250","v":20.88990579184928},{"$f":"InpActive!O250","v":21.672334512988002},{"$f":"InpActive!P250","v":0}]
[null,null,null,null,{"$f":"Index!E$43","v":"CPI(H): Fin year average - inflate from base year 2017-18 average - CALC"},{"$f":"Index!F$43","v":0},{"$f":"Index!G$43","v":"%"},{"$f":"Index!H$43","v":0},{"$f":"Index!I$43","v":0},{"$f":"Index!J$43","v":1.0386214616983847},{"$f":"Index!K$43","v":1.0469374700143934},{"$f":"Index!L$43","v":1.0853990084759317},{"$f":"Index!M$43","v":1.1806332960179113},{"$f":"Index!N$43","v":1.2461218615064769},{"$f":"Index!O$43","v":1.2831440908363987},{"$f":"Index!P$43","v":1.3134495442187752}]
[null,null,null,null,"ASHE GROSS HOURLY WAGE ALL - Real",null,"£ / hour",null,null,{"$f":" IF( J11 = 0, 0, J11 / J12)","v":16.425618600354145},16.753627129000222,16.712747900397819,16.601259735861838,16.763934922540241,16.890024018160897,0]
[]
[null,null,null,null,{"$f":" E$13","v":"ASHE GROSS HOURLY WAGE ALL - Real"},0,"£ / hour",0,0,16.425618600354145,16.753627129000222,16.712747900397819,16.601259735861838,16.763934922540241,16.890024018160897,0]
[null,null,null,null,"ASHE GROSS HOURLY WAGE ALL - Cumulative growth - Real",null,"%",null,null,{"$f":" IF( J15 = 0, 0, J15 / $J$15)","v":1},{"$f":" IF( K15 = 0, 0, K15 / $J$15)","v":1.0199693257603708},1.0174805775678659,1.0106931215061761,1.0205968694645571,1.0282732376238628,0]
[]
[null,null,"Real adjustment factor for wage growth "]
[null,null,null,null,{"$f":"InpActive!E249","v":"OBR Forecast wage growth for PR19 FD"},{"$f":"InpActive!F249","v":0},{"$f":"InpActive!G249","v":"%"},{"$f":"InpActive!H249","v":0},{"$f":"InpActive!I249","v":0},{"$f":"InpActive!J249","v":0.01},{"$f":"InpActive!K249","v":1.0999999999999999E-2},{"$f":"InpActive!L249","v":1.0999999999999999E-2},{"$f":"InpActive!M249","v":1.2E-2},{"$f":"InpActive!N249","v":1.2999999999999999E-2},{"$f":"InpActive!O249","v":1.4E-2},{"$f":"InpActive!P249","v":0}]
[null,null,null,null,{"$f":"Time!E45","v":"Last Pre Forecast Flag"},{"$f":"Time!F45","v":0},{"$f":"Time!G45","v":"flag"},{"$f":"Time!H45","v":1},{"$f":"Time!I45","v":0},{"$f":"Time!J45","v":1},{"$f":"Time!K45","v":0},{"$f":"Time!L45","v":0},{"$f":"Time!M45","v":0},{"$f":"Time!N45","v":0},{"$f":"Time!O45","v":0},{"$f":"Time!P45","v":0}]
[null,null,null,null,"Forecast wage growth for adjuster",null,"%",null,null,{"$f":" IF(J20 = 1, 1, I21 * (J19 + 1))","v":1},{"$f":" IF(K20 = 1, 1, J21 * (K19 + 1))","v":1.0109999999999999},1.0221209999999998,1.0343864519999999,1.0478334758759997,1.0625031445382638,1.0625031445382638]
[]
[null,null,null,null,{"$f":" E$16","v":"ASHE GROSS HOURLY WAGE ALL - Cumulative growth - Real"},0,"%",0,0,1,1.0199693257603708,1.0174805775678659,1.0106931215061761,1.0205968694645571,1.0282732376238628,0]
[null,null,null,null,{"$f":" E$21","v":"Forecast wage growth for adjuster"},0,"%",0,0,1,1.0109999999999999,1.0221209999999998,1.0343864519999999,1.0478334758759997,1.0625031445382638,1.0625031445382638]
[null,null,null,null,{"$f":"Time!E$54","v":"Forecast Period Flag"},{"$f":"Time!F$54","v":0},{"$f":"Time!G$54","v":"flag"},{"$f":"Time!H$54","v":5},{"$f":"Time!I$54","v":0},{"$f":"Time!J$54","v":0},{"$f":"Time!K$54","v":1},{"$f":"Time!L$54","v":1},{"$f":"Time!M$54","v":1},{"$f":"Time!N$54","v":1},{"$f":"Time!O$54","v":1},{"$f":"Time!P$54","v":0}]
[null,null,null,null,"Real adjustment factor for wages",null,"%",null,null,{"$f":" IF( J25 = 1, J23/J24, 0)","v":0},1.0088717366571422,0.99546000675836432,0.97709431475246755,0.97400674149232291,0.96778371236795124,0]
[]
["WATER SERVICES COMBINED"]
[]
[null,null,"Active Sharing Rates -WR/WN"]
[]
[null,null,null,null,{"$f":"E$142","v":"Total variance to forecast net totex for cost sharing - WR"},{"$f":"F$142","v":-11.684587826939785},{"$f":"G$142","v":"£m"}]
[null,null,null,null,{"$f":"E$308","v":"Total variance to forecast net totex for cost sharing - WN"},{"$f":"F$308","v":115.96214606041345},{"$f":"G$308","v":"£m"}]
[null,null,null,null,"Total variance to forecast net totex for cost sharing - WATER",{"$f":"SUM(F32:F33)","v":104.27755823347366},"£m"]
[]
[null,null,null,null,{"$f":"E$34","v":"Total variance to forecast net totex for cost sharing - WATER"},{"$f":"F$34","v":104.27755823347366},{"$f":"G$34","v":"£m"}]
[null,null,null,null,{"$f":" InpActive!E$267","v":"Outperformance Rate - WR"},{"$f":" InpActive!F$267","v":0.43863536681180526},{"$f":" InpActive!G$267","v":"%"}]
[null,null,null,null,{"$f":" InpActive!E$268","v":"Underperformance Rate - WR"},{"$f":" InpActive!F$268","v":0.56136463318819474},{"$f":" InpActive!G$268","v":"%"}]
[null,null,null,null,{"$f":"\"Active Sharing Rate - \"& INDEX(E37:E38,MATCH(F39,F37:F38,0))","v":"Active Sharing Rate - Underperformance Rate - WR"},{"$f":"IF(F36<0,F37,F38)","v":0.56136463318819474},"%"]
[]
[]
[null,null,null,null,{"$f":"E$34","v":"Total variance to forecast net totex for cost sharing - WATER"},{"$f":"F$34","v":104.27755823347366},{"$f":"G$34","v":"£m"}]
[null,null,null,null,{"$f":" InpActive!E$270","v":"Outperformance Rate - WN"},{"$f":" InpActive!F$270","v":0.43863536681180526},{"$f":" InpActive!G$270","v":"%"}]
[null,null,null,null,{"$f":" InpActive!E$271","v":"Underperformance Rate - WN"},{"$f":" InpActive!F$271","v":0.56136463318819474},{"$f":" InpActive!G$271","v":"%"}]
[null,null,null,null,{"$f":"\"Active Sharing Rate - \"& INDEX(E43:E44,MATCH(F45,F43:F44,0))","v":"Active Sharing Rate - Underperformance Rate - WN"},{"$f":"IF(F42<0,F43,F44)","v":0.56136463318819474},"%"]
[]
["WATER RESOURCES"]
[]
[null,null,"Adjustment For Wage Growth"]
[]
[null,null,null,"Totex for wage adjustment"]
[null,null,null,null,{"$f":" InpActive!E$29","v":"Base Costs - WR - Real"},{"$f":" InpActive!F$29","v":60.8},{"$f":" InpActive!G$29","v":"£m"}]
[null,null,null,null,{"$f":" InpActive!E$30","v":"Metering (excluding new connections) for meters requested by optants, customers and businesses - WR - Real"},{"$f":" InpActive!F$30","v":0},{"$f":" InpActive!G$30","v":"£m"}]
[null,null,null,null,"Totex available for wage indexation adjustment - WR - Real",{"$f":" SUM(F52:F53)","v":60.8},"£m"]
[]
[null,null,null,"Profile for totex for wage adjustment"]
[null,null,null,null,{"$f":"InpActive!E$32","v":"Opex split profile - Base costs - WR "},{"$f":"InpActive!F$32","v":0},{"$f":"InpActive!G$32","v":"%"},{"$f":"InpActive!H$32","v":0},{"$f":"InpActive!I$32","v":0},{"$f":"InpActive!J$32","v":0},{"$f":"InpActive!K$32","v":0.14434578369805173},{"$f":"InpActive!L$32","v":0.14983284433448402},{"$f":"InpActive!M$32","v":0.16636012381742027},{"$f":"InpActive!N$32","v":0.14991393612749104},{"$f":"InpActive!O$32","v":0.15116814522775562},{"$f":"InpActive!P$32","v":0}]
[null,null,null,null,{"$f":"InpActive!E$33","v":"Capex Split Profile - Base costs - WR"},{"$f":"InpActive!F$33","v":0},{"$f":"InpActive!G$33","v":"%"},{"$f":"InpActive!H$33","v":0},{"$f":"InpActive!I$33","v":0},{"$f":"InpActive!J$33","v":0},{"$f":"InpActive!K$33","v":4.6275016569606399E-2},{"$f":"InpActive!L$33","v":6.8844429679159908E-2},{"$f":"InpActive!M$33","v":5.5149711608228472E-2},{"$f":"InpActive!N$33","v":3.4161867220366939E-2},{"$f":"InpActive!O$33","v":3.3948141717435654E-2},{"$f":"InpActive!P$33","v":0}]
[null,null,null,null,"Totex profile - Base costs - WR",null,"%",{"$f":" SUM(J59:P59)","v":1},null,{"$f":" SUM(J57:J58)","v":0},0.19062080026765812,0.21867727401364392,0.22150983542564873,0.18407580334785797,0.18511628694519128,0]
[null,null,null,null,"Totex profile - Base costs - 5 year percentage - WR",{"$f":"H$59","v":1},"%"]
[]
[null,null,null,null,{"$f":" E$60","v":"Totex profile - Base costs - 5 year percentage - WR"},{"$f":" F$60","v":1},{"$f":" G$60","v":"%"}]
[null,null,null,null,"WR Totex profile 100% check",{"$f":" IF(OR($F$62 = 1, F62 = 0), 0, 1)","v":0},"Check"]
[]
[null,null,null,null,{"$f":" E$54","v":"Totex available for wage indexation adjustment - WR - Real"},{"$f":" F$54","v":60.8},{"$f":" G$54","v":"£m"}]
[null,null,null,null,{"$f":"Time!E$54","v":"Forecast Period Flag"},{"$f":"Time!F$54","v":0},{"$f":"Time!G$54","v":"flag"},{"$f":"Time!H$54","v":5},{"$f":"Time!I$54","v":0},{"$f":"Time!J$54","v":0},{"$f":"Time!K$54","v":1},{"$f":"Time!L$54","v":1},{"$f":"Time!M$54","v":1},{"$f":"Time!N$54","v":1},{"$f":"Time!O$54","v":1},{"$f":"Time!P$54","v":0}]
[null,null,null,null,{"$f":" E$59","v":"Totex profile - Base costs - WR"},0,"%",1,0,0,0.19062080026765812,0.21867727401364392,0.22150983542564873,0.18407580334785797,0.18511628694519128,0]
[null,null,null,null,"Profiled Totex available for wage indexation adjustment - WR - Real",null,"£m",{"$f":" SUM(J68:P68)","v":60.8},null,{"$f":" IF(J66 = 1, J67 * $F65, 0)","v":0},11.589744656273613,13.295578260029551,13.467797993879442,11.191808843549765,11.255070246267628,0]
[]
[null,null,null,"Totex applicable for wage adjustment by year"]
[null,null,null,null,{"$f":"InpActive!E$253","v":"Percentage totex linked to wage growth - WR"},{"$f":"InpActive!F$253","v":0.38600000000000001},{"$f":"InpActive!G$253","v":"%"}]
[null,null,null,null,{"$f":"E68","v":"Profiled Totex available for wage indexation adjustment - WR - Real"},0,"£m",60.8,0,0,11.589744656273613,13.295578260029551,13.467797993879442,11.191808843549765,11.255070246267628,0]
[null,null,null,null,"Profiled Net totex available for wage adj - WR - Real",null,"£m",{"$f":" SUM(J73:P73)","v":23.468800000000002},null,{"$f":" J72 * $F71","v":0},4.4736414373216142,5.1320932083714066,5.1985700256374647,4.3200382136102098,4.3444571150593045,0]
[]
[null,null,null,"Adjustment factor for wage linked totex"]
[null,null,null,null,{"$f":"Time!E$54","v":"Forecast Period Flag"},{"$f":"Time!F$54","v":0},{"$f":"Time!G$54","v":"flag"},{"$f":"Time!H$54","v":5},{"$f":"Time!I$54","v":0},{"$f":"Time!J$54","v":0},{"$f":"Time!K$54","v":1},{"$f":"Time!L$54","v":1},{"$f":"Time!M$54","v":1},{"$f":"Time!N$54","v":1},{"$f":"Time!O$54","v":1},{"$f":"Time!P$54","v":0}]
[null,null,null,null,{"$f":" E$73","v":"Profiled Net totex available for wage adj - WR - Real"},0,"£m",23.468800000000002,0,0,4.4736414373216142,5.1320932083714066,5.1985700256374647,4.3200382136102098,4.3444571150593045,0]
[null,null,null,null,{"$f":" E$26","v":"Real adjustment factor for wages"},0,"%",0,0,0,1.0088717366571422,0.99546000675836432,0.97709431475246755,0.97400674149232291,0.96778371236795124,0]
[null,null,null,null,"Profiled adjustment wage related totex - WR - Real",null,"£m",{"$f":" SUM(J79:P79)","v":23.113858341431175},null,{"$f":" IF(J76 = 1, J77 * J78, 0)","v":0},4.5133304060520105,5.1087935398899562,5.0794932168929563,4.207746343560796,4.2044948350354536,0]
[]
[null,null,null,"Variance to forecast wage linked totex "]
[null,null,null,null,{"$f":" E$79","v":"Profiled adjustment wage related totex - WR - Real"},0,"£m",23.113858341431175,0,0,4.5133304060520105,5.1087935398899562,5.0794932168929563,4.207746343560796,4.2044948350354536,0]
[null,null,null,null,{"$f":" E$73","v":"Profiled Net totex available for wage adj - WR - Real"},0,"£m",23.468800000000002,0,0,4.4736414373216142,5.1320932083714066,5.1985700256374647,4.3200382136102098,4.3444571150593045,0]
[null,null,null,null,"Variance to forecast totex for wage adjustment - WR",null,"£m",{"$f":" SUM(J84:P84)","v":-0.3549416585688272},null,{"$f":" J82 - J83","v":0},{"$f":" K82 - K83","v":3.968896873039629E-2},-2.3299668481450375E-2,-0.11907680874450843,-0.11229187004941377,-0.13996228002385092,0]
[]
[null,null,null,"Wage totex overfunded/unfunded at PR19"]
[null,null,null,null,{"$f":" E$84","v":"Variance to forecast totex for wage adjustment - WR"},{"$f":" F$84","v":0},"£m",-0.3549416585688272,0,0,{"$f":" K$84","v":3.968896873039629E-2},-2.3299668481450375E-2,-0.11907680874450843,-0.11229187004941377,-0.13996228002385092,0]
[null,null,null,null,{"$f":"E137","v":"Time value of money factor - WR"},0,"Factor",0,0,1,1.122016155346969,1.0901828170879997,1.0592526399999997,1.0291999999999999,1,1]
[null,null,null,null,"Variance to forecast totex for wage adjustment - NPV adjusted - WR",null,"£m",{"$f":" SUM(J89:P89)","v":-0.36253473082186188},null,{"$f":" J87*J88","v":0},{"$f":" K87*K88","v":4.453166410456532E-2},{"$f":" L87*L88","v":-2.5400898222324046E-2},-0.12613242402539562,-0.11557079265485663,-0.13996228002385092,0]
[null,null,null,null,"(Under)/Overfunded wage related totex at PR19 - WR",{"$f":" H89 * -1","v":0.36253473082186188},"£m"]
[]
[null,null,"Cost sharing on net totex available for reconciliation"]
[]
[null,null,null,null,{"$f":"InpActive!E$42","v":"Net totex for cost sharing reconciliation - WR - Nominal"},{"$f":"InpActive!F$42","v":0},{"$f":"InpActive!G$42","v":"£m"},{"$f":"InpActive!H$42","v":0},{"$f":"InpActive!I$42","v":0},{"$f":"InpActive!J$42","v":0},{"$f":"InpActive!K$42","v":9.2840000000000007},{"$f":"InpActive!L$42","v":10.571000000000002},{"$f":"InpActive!M$42","v":13.416},{"$f":"InpActive!N$42","v":14.293590415300001},{"$f":"InpActive!O$42","v":18.70673979922287},{"$f":"InpActive!P$42","v":0}]
[null,null,null,null,{"$f":"Index!E$43","v":"CPI(H): Fin year average - inflate from base year 2017-18 average - CALC"},{"$f":"Index!F$43","v":0},{"$f":"Index!G$43","v":"%"},{"$f":"Index!H$43","v":0},{"$f":"Index!I$43","v":0},{"$f":"Index!J$43","v":1.0386214616983847},{"$f":"Index!K$43","v":1.0469374700143934},{"$f":"Index!L$43","v":1.0853990084759317},{"$f":"Index!M$43","v":1.1806332960179113},{"$f":"Index!N$43","v":1.2461218615064769},{"$f":"Index!O$43","v":1.2831440908363987},{"$f":"Index!P$43","v":1.3134495442187752}]
[null,null,null,null,"Actual net totex for cost sharing reconciliation - WR - Real",null,"£m",null,null,{"$f":" J94 / J95","v":0},{"$f":" K94 / K95","v":8.8677693423966986},{"$f":" L94 / L95","v":9.7392755267423006},11.363392888587878,11.470459556836616,14.578830181908218,0]
[]
[null,null,null,null,{"$f":"InpActive!E$44","v":"Performance related pay recovery mechanism adjustment - WR - Nominal (Neg)"},{"$f":"InpActive!F$44","v":0},{"$f":"InpActive!G$44","v":"£m"},{"$f":"InpActive!H$44","v":0},{"$f":"InpActive!I$44","v":0},{"$f":"InpActive!J$44","v":0},{"$f":"InpActive!K$44","v":0},{"$f":"InpActive!L$44","v":0},{"$f":"InpActive!M$44","v":0},{"$f":"InpActive!N$44","v":0},{"$f":"InpActive!O$44","v":0},{"$f":"InpActive!P$44","v":0}]
[null,null,null,null,{"$f":"Index!E$43","v":"CPI(H): Fin year average - inflate from base year 2017-18 average - CALC"},{"$f":"Index!F$43","v":0},{"$f":"Index!G$43","v":"%"},{"$f":"Index!H$43","v":0},{"$f":"Index!I$43","v":0},{"$f":"Index!J$43","v":1.0386214616983847},{"$f":"Index!K$43","v":1.0469374700143934},{"$f":"Index!L$43","v":1.0853990084759317},{"$f":"Index!M$43","v":1.1806332960179113},{"$f":"Index!N$43","v":1.2461218615064769},{"$f":"Index!O$43","v":1.2831440908363987},{"$f":"Index!P$43","v":1.3134495442187752}]
[null,null,null,null,"Performance related pay recovery mechanism adjustment  - WR - real",null,"£m",{"$f":"SUM(K100:O100)","v":0},null,{"$f":" J98 / J99","v":0},{"$f":" K98 / K99","v":0},{"$f":" L98 / L99","v":0},0,0,0,0]
[null,null,null,null,"Total Performance related pay recovery mechanism adjustment  - WR - real",{"$f":"H100","v":0},"£m"]
[]
[null,null,null,null,{"$f":" E$96","v":"Actual net totex for cost sharing reconciliation - WR - Real"},{"$f":" F$96","v":0},"£m",0,0,0,8.8677693423966986,9.7392755267423006,11.363392888587878,11.470459556836616,14.578830181908218,0]
[null,null,null,null,{"$f":"E100","v":"Performance related pay recovery mechanism adjustment  - WR - real"},{"$f":"F100","v":0},"£m",0,0,0,0,0,0,0,0,0]
[null,null,null,null,{"$f":"Time!E$54","v":"Forecast Period Flag"},{"$f":"Time!F$54","v":0},{"$f":"Time!G$54","v":"flag"},{"$f":"Time!H$54","v":5},{"$f":"Time!I$54","v":0},{"$f":"Time!J$54","v":0},{"$f":"Time!K$54","v":1},{"$f":"Time!L$54","v":1},{"$f":"Time!M$54","v":1},{"$f":"Time!N$54","v":1},{"$f":"Time!O$54","v":1},{"$f":"Time!P$54","v":0}]
[null,null,null,null,"Actual net totex for cost sharing reconciliation - WR - Real ",null,"£m",{"$f":" SUM(J106:P106)","v":56.01972749647171},null,{"$f":" (J103 + J104)* J105","v":0},{"$f":" (K103 + K104)* K105","v":8.8677693423966986},{"$f":" (L103 + L104)* L105","v":9.7392755267423006},11.363392888587878,11.470459556836616,14.578830181908218,0]
[]
[null,null,null,"Profile for net totex for cost sharing"]
[]
[null,null,null,null,{"$f":"InpActive!E$35","v":"Opex split profile - Cost sharing - WR"},{"$f":"InpActive!F$35","v":0},{"$f":"InpActive!G$35","v":"%"},{"$f":"InpActive!H$35","v":0},{"$f":"InpActive!I$35","v":0},{"$f":"InpActive!J$35","v":0},{"$f":"InpActive!K$35","v":9.6909583115797615E-2},{"$f":"InpActive!L$35","v":9.9662115984483712E-2},{"$f":"InpActive!M$35","v":0.11479630140556592},{"$f":"InpActive!N$35","v":9.9736372502791146E-2},{"$f":"InpActive!O$35","v":0.10088486358384358},{"$f":"InpActive!P$35","v":0}]
[null,null,null,null,{"$f":"InpActive!E$36","v":"Capex split profile - Cost sharing - WR"},{"$f":"InpActive!F$36","v":0},{"$f":"InpActive!G$36","v":"%"},{"$f":"InpActive!H$36","v":0},{"$f":"InpActive!I$36","v":0},{"$f":"InpActive!J$36","v":0},{"$f":"InpActive!K$36","v":0.18786424367820603},{"$f":"InpActive!L$36","v":0.1014864395293926},{"$f":"InpActive!M$36","v":9.2486720719550872E-2},{"$f":"InpActive!N$36","v":5.9215654705368458E-2},{"$f":"InpActive!O$36","v":4.6957704774999942E-2},{"$f":"InpActive!P$36","v":0}]
[null,null,null,null,"Totex profile - Cost Sharing - WR",null,"%",{"$f":" SUM(J112:P112)","v":0.99999999999999978},null,{"$f":" SUM(J110:J111)","v":0},{"$f":" SUM(K110:K111)","v":0.28477382679400365},0.20114855551387631,0.20728302212511679,0.1589520272081596,0.14784256835884352,0]
[null,null,null,null,"Totex profile - Cost Sharing - 5 year percentage - WR",{"$f":"H$59","v":1},"%"]
[]
[null,null,null,null,{"$f":" E$60","v":"Totex profile - Base costs - 5 year percentage - WR"},{"$f":" F$60","v":1},{"$f":" G$60","v":"%"}]
[null,null,null,null,"WR Totex profile - Cost sharing 100% check",{"$f":" IF(OR($F$115 = 1, F115 = 0), 0, 1)","v":0},"Check"]
[]
[null,null,null,null,{"$f":"InpActive!E$43","v":"Net totex available for cost sharing - WR - Real"},{"$f":"InpActive!F$43","v":66.400000000000006},{"$f":"InpActive!G$43","v":"£m"}]
[null,null,null,null,{"$f":" E$112","v":"Totex profile - Cost Sharing - WR"},{"$f":" F$112","v":0},"%",0.99999999999999978,0,0,0.28477382679400365,0.20114855551387631,0.20728302212511679,0.1589520272081596,0.14784256835884352,0]
[null,null,null,null,"Net totex available for cost sharing profiled - WR - Real",null,"£m",{"$f":" SUM(J120:P120)","v":66.399999999999991},null,{"$f":" J119 * $F118","v":0},{"$f":" K119 * $F118","v":18.908982099121843},13.356264086121389,13.763592669107757,10.554414606621798,9.8167465390272106,0]
[]
[]
[null,null,null,null,{"$f":" E$120","v":"Net totex available for cost sharing profiled - WR - Real"},0,"£m",66.399999999999991,0,0,18.908982099121843,13.356264086121389,13.763592669107757,10.554414606621798,9.8167465390272106,0]
[null,null,null,null,{"$f":" E$84","v":"Variance to forecast totex for wage adjustment - WR"},0,"£m",-0.3549416585688272,0,0,3.968896873039629E-2,-2.3299668481450375E-2,-0.11907680874450843,-0.11229187004941377,-0.13996228002385092,0]
[null,null,null,null,{"$f":"InpActive!E$46","v":"Total final WINEP reconciliation - WR - real"},{"$f":"InpActive!F$46","v":0},{"$f":"InpActive!G$46","v":"£m"},{"$f":"InpActive!H$46","v":0},{"$f":"InpActive!I$46","v":0},{"$f":"InpActive!J$46","v":0},{"$f":"InpActive!K$46","v":0},{"$f":"InpActive!L$46","v":0},{"$f":"InpActive!M$46","v":0},{"$f":"InpActive!N$46","v":0},{"$f":"InpActive!O$46","v":0},{"$f":"InpActive!P$46","v":0}]
[null,null,null,null,{"$f":"E100","v":"Performance related pay recovery mechanism adjustment  - WR - real"},{"$f":"F100","v":0},"£m",0,0,0,0,0,0,0,0,0]
[null,null,null,null,"Net totex available for cost sharing after adjustments profiled - WR - Real",null,"£m",{"$f":" SUM(J127:P127)","v":66.045058341431158},null,{"$f":"SUM(J123:J126)","v":0},{"$f":"SUM(K123:K126)","v":18.948671067852239},{"$f":"SUM(L123:L126)","v":13.332964417639939},13.644515860363249,10.442122736572383,9.6767842590033588,0]
[]
[null,null,null,"Variance to forecast net totex for cost sharing"]
[null,null,null,null,{"$f":" E$106","v":"Actual net totex for cost sharing reconciliation - WR - Real "},0,"£m",56.01972749647171,0,0,8.8677693423966986,9.7392755267423006,11.363392888587878,11.470459556836616,14.578830181908218,0]
[null,null,null,null,{"$f":" E$127","v":"Net totex available for cost sharing after adjustments profiled - WR - Real"},0,"£m",66.045058341431158,0,0,18.948671067852239,13.332964417639939,13.644515860363249,10.442122736572383,9.6767842590033588,0]
[null,null,null,null,"Variance to forecast net totex for cost sharing - WR",null,"£m",{"$f":" SUM(J132:P132)","v":-10.025330844959457},null,{"$f":" J130 - J131","v":0},-10.08090172545554,-3.5936888908976385,-2.2811229717753712,1.0283368202642329,4.9020459229048594,0]
[]
[null,null,null,"Variance to forecast net totex for cost sharing - Time adjusted"]
[null,null,null,null,{"$f":" InpActive!E$288","v":"Financing cost index"},{"$f":" InpActive!F$288","v":0},{"$f":" InpActive!G$288","v":"Index"},{"$f":" InpActive!H$288","v":0},{"$f":" InpActive!I$288","v":0},{"$f":" InpActive!J$288","v":0},{"$f":" InpActive!K$288","v":4},{"$f":" InpActive!L$288","v":3},{"$f":" InpActive!M$288","v":2},{"$f":" InpActive!N$288","v":1},{"$f":" InpActive!O$288","v":0},{"$f":" InpActive!P$288","v":0}]
[null,null,null,null,{"$f":" InpActive!E$290","v":"Real WACC CPIH Deflated - WR"},{"$f":" InpActive!F$290","v":2.92E-2},{"$f":" InpActive!G$290","v":"%"}]
[null,null,null,null,"Time value of money factor - WR",null,"Factor",null,null,{"$f":"(1+$F136) ^ J135","v":1},1.122016155346969,1.0901828170879997,1.0592526399999997,1.0291999999999999,1,1]
[]
[null,null,null,null,{"$f":" E$132","v":"Variance to forecast net totex for cost sharing - WR"},0,"£m",-10.025330844959457,0,0,-10.08090172545554,-3.5936888908976385,-2.2811229717753712,1.0283368202642329,4.9020459229048594,0]
[null,null,null,null,{"$f":"E$137","v":"Time value of money factor - WR"},0,"Factor",0,0,1,1.122016155346969,1.0901828170879997,1.0592526399999997,1.0291999999999999,1,1]
[null,null,null,null,"Time adjusted variance to forecast net totex for cost sharing - WR",null,"£m",{"$f":" SUM(J141:P141)","v":-11.684587826939785},null,{"$f":" J139 * J140","v":0},-11.31093459642625,-3.9177778788166369,-2.4162855300177069,1.0583642554159485,4.9020459229048594,0]
[null,null,null,null,"Total variance to forecast net totex for cost sharing - WR",{"$f":" $H141","v":-11.684587826939785},"£m"]
[]
[null,null,null,"Under / Overperformance on net totex for cost sharing"]
[null,null,null,null,{"$f":"E$142","v":"Total variance to forecast net totex for cost sharing - WR"},{"$f":"F$142","v":-11.684587826939785},{"$f":"G$142","v":"£m"}]
[null,null,null,null,{"$f":"E$39","v":"Active Sharing Rate - Underperformance Rate - WR"},{"$f":"F$39","v":0.56136463318819474},{"$f":"G$39","v":"%"}]
[null,null,null,null,"Active adjustment for cost sharing - Net totex for cost sharing - WR - Real",{"$f":" F145 * (1-F146)","v":-5.1252734675144866},"£m"]
[]
[null,null,null,null,{"$f":" InpActive!E$57","v":"Ex ante allowance above Ofwat forecast  - Water Resources - Real"},{"$f":" InpActive!F$57","v":0},{"$f":" InpActive!G$57","v":"£m"}]
[null,null,null,null,{"$f":" E$112","v":"Totex profile - Cost Sharing - WR"},{"$f":" F$112","v":0},"%",0.99999999999999978,0,0,0.28477382679400365,0.20114855551387631,0.20728302212511679,0.1589520272081596,0.14784256835884352,0]
[null,null,null,null,"Ex ante allowance profiled - WR - Real",null,"£m",{"$f":" SUM(J151:P151)","v":0},null,{"$f":" J150 * $F149","v":0},0,0,0,0,0,0]
[]
[null,null,null,null,{"$f":" E$151","v":"Ex ante allowance profiled - WR - Real"},0,"£m",0,0,0,0,0,0,0,0,0]
[null,null,null,null,{"$f":"E$137","v":"Time value of money factor - WR"},0,"Factor",0,0,1,1.122016155346969,1.0901828170879997,1.0592526399999997,1.0291999999999999,1,1]
[null,null,null,null,"Ex ante allowance profiled - WR - Real - NPV adjusted",null,"£m",{"$f":" SUM(J155:P155)","v":0},null,{"$f":" J153 * J154","v":0},0,0,0,0,0,0]
[null,null,null,null,"NPV adjusted ex ante allowance - WR - Real",{"$f":" H155","v":0},"£m"]
[]
[null,null,null,null,{"$f":"InpActive!E$64","v":"Actuals for CMA excluded items - WR - nominal"},{"$f":"InpActive!F$64","v":0},{"$f":"InpActive!G$64","v":"£m"},{"$f":"InpActive!H$64","v":0},{"$f":"InpActive!I$64","v":0},{"$f":"InpActive!J$64","v":0},{"$f":"InpActive!K$64","v":0},{"$f":"InpActive!L$64","v":0},{"$f":"InpActive!M$64","v":0},{"$f":"InpActive!N$64","v":0},{"$f":"InpActive!O$64","v":0},{"$f":"InpActive!P$64","v":0}]
[null,null,null,null,{"$f":"Index!E$43","v":"CPI(H): Fin year average - inflate from base year 2017-18 average - CALC"},{"$f":"Index!F$43","v":0},{"$f":"Index!G$43","v":"%"},{"$f":"Index!H$43","v":0},{"$f":"Index!I$43","v":0},{"$f":"Index!J$43","v":1.0386214616983847},{"$f":"Index!K$43","v":1.0469374700143934},{"$f":"Index!L$43","v":1.0853990084759317},{"$f":"Index!M$43","v":1.1806332960179113},{"$f":"Index!N$43","v":1.2461218615064769},{"$f":"Index!O$43","v":1.2831440908363987},{"$f":"Index!P$43","v":1.3134495442187752}]
[null,null,null,null,"Actuals for CMA excluded items - WR - real",null,"£m",null,null,{"$f":" J158 / J159","v":0},{"$f":" K158 / K159","v":0},{"$f":" L158 / L159","v":0},0,0,0,0]
[]
[null,null,null,null,{"$f":"InpActive!E$65","v":"Allowance for CMA excluded items - WR - real"},{"$f":"InpActive!F$65","v":0},{"$f":"InpActive!G$65","v":"£m"},{"$f":"InpActive!H$65","v":0},{"$f":"InpActive!I$65","v":0},{"$f":"InpActive!J$65","v":0},{"$f":"InpActive!K$65","v":0},{"$f":"InpActive!L$65","v":0},{"$f":"InpActive!M$65","v":0},{"$f":"InpActive!N$65","v":0},{"$f":"InpActive!O$65","v":0},{"$f":"InpActive!P$65","v":0}]
[null,null,null,null,{"$f":"E160","v":"Actuals for CMA excluded items - WR - real"},{"$f":"F160","v":0},"£m",0,0,0,{"$f":"K160","v":0},0,0,0,0,0]
[null,null,null,null,"Variance to allowances for CMA excluded items - WR",null,"£m",{"$f":" SUM(J164:P164)","v":0},null,{"$f":"J163-J162","v":0},0,{"$f":"L163-L162","v":0},0,0,0,0]
[]
[null,null,null,null,{"$f":"E$164","v":"Variance to allowances for CMA excluded items - WR"},{"$f":"F$164","v":0},"£m",0,0,0,0,0,0,0,0,0]
[null,null,null,null,{"$f":"E$137","v":"Time value of money factor - WR"},0,"Factor",0,0,1,1.122016155346969,1.0901828170879997,1.0592526399999997,1.0291999999999999,1,1]
[null,null,null,null,"Time value adjusted variance to allowances for CMA excluded items - WR - real",null,"£m",{"$f":" SUM(J168:P168)","v":0},null,{"$f":" J166 * J167","v":0},{"$f":" K166 * K167","v":0},0,0,0,0,0]
[null,null,null,null,"Total variance to allowances for CMA excluded items - WR",{"$f":" $H168","v":0},"£m"]
[]
[null,null,null,null,{"$f":"E169","v":"Total variance to allowances for CMA excluded items - WR"},{"$f":"F169","v":0},"£m"]
[null,null,null,null,{"$f":"InpActive!E66","v":"CMA excluded items sharing rate - WR - real"},{"$f":"InpActive!F66","v":0},{"$f":"InpActive!G66","v":"%"}]
[null,null,null,null,"Allowable adjustment for CMA excluded items - WR - Real",{"$f":"(F171* F172) * -1","v":0},"£m"]
[]
[null,null,null,null,{"$f":"E147","v":"Active adjustment for cost sharing - Net totex for cost sharing - WR - Real"},{"$f":"F147","v":-5.1252734675144866},{"$f":"G147","v":"£m"}]
[null,null,null,null,{"$f":" E$156","v":"NPV adjusted ex ante allowance - WR - Real"},{"$f":" F$156","v":0},{"$f":" G$156","v":"£m"}]
[null,null,null,null,{"$f":"E90","v":"(Under)/Overfunded wage related totex at PR19 - WR"},{"$f":"F90","v":0.36253473082186188},{"$f":"G90","v":"£m"}]
[null,null,null,null,{"$f":"E$173","v":"Allowable adjustment for CMA excluded items - WR - Real"},{"$f":"F$173","v":0},"£m"]
[null,null,null,null,{"$f":"E101","v":"Total Performance related pay recovery mechanism adjustment  - WR - real"},{"$f":"F101","v":0},"£m"]
[null,null,null,null,"Total adjustment for cost sharing after ex ante allowance & wage adjustment - WR - Real",{"$f":" F175 - SUM(F176:F178) +F179","v":-5.4878081983363485},"£m"]
[]
[null,null,"Wholesaler bad debt sharing adjustment"]
[]
[null,null,null,null,{"$f":" InpActive!E$60","v":"Business retail bad debt liability due to covid liquidity measures - WR - real"},{"$f":" InpActive!F$60","v":0},{"$f":" InpActive!G$60","v":"£m"}]
[null,null,null,null,{"$f":"E$39","v":"Active Sharing Rate - Underperformance Rate - WR"},{"$f":"F$39","v":0.56136463318819474},{"$f":"G$39","v":"%"}]
[null,null,null,null,"Embedded customer share - WR",{"$f":" F184 * (1-F185)","v":0},"£m"]
[]
[null,null,null,null,{"$f":" InpActive!E$61","v":"Total Wholesaler Liability - WR - real"},{"$f":" InpActive!F$61","v":0},{"$f":" InpActive!G$61","v":"£m"}]
[null,null,null,null,{"$f":"E$39","v":"Active Sharing Rate - Underperformance Rate - WR"},{"$f":"F$39","v":0.56136463318819474},{"$f":"G$39","v":"%"}]
[null,null,null,null,"Wholesaler liability - WR",{"$f":" F188 * (F189)","v":0},"£m"]
[]
[null,null,null,null,{"$f":" InpActive!E$60","v":"Business retail bad debt liability due to covid liquidity measures - WR - real"},{"$f":" InpActive!F$60","v":0},{"$f":" InpActive!G$60","v":"£m"}]
[null,null,null,null,{"$f":" E$190","v":"Wholesaler liability - WR"},{"$f":" F$190","v":0},"£m"]
[null,null,null,null,"Customer Liability",{"$f":" F192 - F193","v":0},"£m"]
[]
[null,null,null,null,{"$f":" E194","v":"Customer Liability"},{"$f":" F194","v":0},"£m"]
[null,null,null,null,{"$f":"E186","v":"Embedded customer share - WR"},{"$f":"F186","v":0},"£m"]
[null,null,null,null,"Wholesaler bad debt adjustment - WR",{"$f":" IF(F196 > F197, F196 - F197, 0)","v":0},"£m"]
[]
[null,null,"Cost sharing adjustment RCV/Revenue Split"]
[]
[null,null,null,null,{"$f":" E$180","v":"Total adjustment for cost sharing after ex ante allowance & wage adjustment - WR - Real"},{"$f":" F$180","v":-5.4878081983363485},{"$f":" G$180","v":"£m"}]
[null,null,null,null,{"$f":"InpActive!E$55","v":"Weighted average PAYG rate - WR"},{"$f":"InpActive!F$55","v":0.64100000000000001},{"$f":"InpActive!G$55","v":"%"}]
[null,null,null,null,"Cost sharing revenue exc bad debt adjustment- WR - Real",{"$f":" F202 * ( $F$203)","v":-3.5176850551335996},"£m"]
[]
[null,null,null,null,{"$f":"E$204","v":"Cost sharing revenue exc bad debt adjustment- WR - Real"},{"$f":"F$204","v":-3.5176850551335996},"£m"]
[null,null,null,null,{"$f":"E198","v":"Wholesaler bad debt adjustment - WR"},{"$f":"F198","v":0},{"$f":"G198","v":"£m"}]
[null,null,null,null,"Cost sharing revenue adjustment - WR - Real",{"$f":" SUM(F206:F207)","v":-3.5176850551335996},"£m"]
[]
[null,null,null,null,{"$f":" E$180","v":"Total adjustment for cost sharing after ex ante allowance & wage adjustment - WR - Real"},{"$f":" F$180","v":-5.4878081983363485},"£m"]
[null,null,null,null,{"$f":"InpActive!E$55","v":"Weighted average PAYG rate - WR"},{"$f":"InpActive!F$55","v":0.64100000000000001},{"$f":"InpActive!G$55","v":"%"}]
[null,null,null,null,"Cost sharing RCV adjustment - WR - Real",{"$f":" F210 * (1 - $F$211)","v":-1.9701231432027491},"£m"]
[]
["WATER NETWORK"]
[]
[null,null,"Adjustment For Wage Growth"]
[]
[null,null,null,"Totex for wage adjustment"]
[null,null,null,null,{"$f":" InpActive!E$70","v":"Base Costs - WN - Real"},{"$f":" InpActive!F$70","v":486.2},{"$f":" InpActive!G$70","v":"£m"}]
[null,null,null,null,{"$f":" InpActive!E$71","v":"Metering (excluding new connections) for meters requested by optants, customers and businesses - WN - Real"},{"$f":" InpActive!F$71","v":10.924016350800301},{"$f":" InpActive!G$71","v":"£m"}]
[null,null,null,null,"Totex available for wage indexation adjustment - WN - Real",{"$f":" SUM(F219:F220)","v":497.12401635080028},"£m"]
[]
[null,null,null,"Profile for totex for wage adjustment"]
[null,null,null,null,{"$f":"InpActive!E$73","v":"Opex Split Profile - Base costs - WN"},{"$f":"InpActive!F$73","v":0},{"$f":"InpActive!G$73","v":"%"},{"$f":"InpActive!H$73","v":0},{"$f":"InpActive!I$73","v":0},{"$f":"InpActive!J$73","v":0},{"$f":"InpActive!K$73","v":0.13},{"$f":"InpActive!L$73","v":0.13},{"$f":"InpActive!M$73","v":0.13},{"$f":"InpActive!N$73","v":0.13},{"$f":"InpActive!O$73","v":0.13},{"$f":"InpActive!P$73","v":0}]
[null,null,null,null,{"$f":"InpActive!E$74","v":"Capex Split Profile - Base costs - WN"},{"$f":"InpActive!F$74","v":0},{"$f":"InpActive!G$74","v":"%"},{"$f":"InpActive!H$74","v":0},{"$f":"InpActive!I$74","v":0},{"$f":"InpActive!J$74","v":0},{"$f":"InpActive!K$74","v":6.9000000000000006E-2},{"$f":"InpActive!L$74","v":0.06},{"$f":"InpActive!M$74","v":9.7000000000000003E-2},{"$f":"InpActive!N$74","v":6.7000000000000004E-2},{"$f":"InpActive!O$74","v":5.7000000000000002E-2},{"$f":"InpActive!P$74","v":0}]
[null,null,null,null,"Totex profile - Base costs - WN",null,"%",{"$f":" SUM(J226:P226)","v":1},null,{"$f":" SUM(J224:J225)","v":0},0.19900000000000001,0.19,0.22700000000000001,0.19700000000000001,0.187,0]
[null,null,null,null,"Totex profile - Base costs - 5 year percentage - WN",{"$f":"H$226","v":1},"%"]
[]
[null,null,null,null,{"$f":" E$227","v":"Totex profile - Base costs - 5 year percentage - WN"},{"$f":" F$227","v":1},{"$f":" G$227","v":"%"}]
[null,null,null,null,"WN Totex profile - Base costs 100% check",{"$f":" IF(OR($F$229 = 1, F229 = 0), 0, 1)","v":0},"Check"]
[]
[null,null,null,null,{"$f":" E$221","v":"Totex available for wage indexation adjustment - WN - Real"},{"$f":" F$221","v":497.12401635080028},{"$f":" G$221","v":"£m"}]
[null,null,null,null,{"$f":"Time!E$54","v":"Forecast Period Flag"},{"$f":"Time!F$54","v":0},{"$f":"Time!G$54","v":"flag"},{"$f":"Time!H$54","v":5},{"$f":"Time!I$54","v":0},{"$f":"Time!J$54","v":0},{"$f":"Time!K$54","v":1},{"$f":"Time!L$54","v":1},{"$f":"Time!M$54","v":1},{"$f":"Time!N$54","v":1},{"$f":"Time!O$54","v":1},{"$f":"Time!P$54","v":0}]
[null,null,null,null,{"$f":" E$226","v":"Totex profile - Base costs - WN"},0,"%",1,0,0,0.19900000000000001,0.19,0.22700000000000001,0.19700000000000001,0.187,0]
[null,null,null,null,"Profiled Totex available for wage indexation adjustment - WN - Real",null,"£m",{"$f":" SUM(J235:P235)","v":497.12401635080028},null,{"$f":" IF(J233 = 1, J234 * $F232, 0)","v":0},98.927679253809259,94.453563106652055,112.84715171163167,97.933431221107654,92.962191057599654,0]
[]
[null,null,null,"Totex applicable for wage adjustment by year"]
[null,null,null,null,{"$f":"InpActive!E$255","v":"Percentage totex linked to wage growth - WN"},{"$f":"InpActive!F$255","v":0.38600000000000001},{"$f":"InpActive!G$255","v":"%"}]
[null,null,null,null,{"$f":"E235","v":"Profiled Totex available for wage indexation adjustment - WN - Real"},0,"£m",497.12401635080028,0,0,98.927679253809259,94.453563106652055,112.84715171163167,97.933431221107654,92.962191057599654,0]
[null,null,null,null,"Profiled Net totex available for wage adj - WN - Real",null,"£m",{"$f":" SUM(J240:P240)","v":191.88987031140888},null,{"$f":" J239 * $F238","v":0},38.186084191970373,36.459075359167691,43.559000560689825,37.802304451347553,35.883405748233464,0]
[]
[null,null,null,"Adjustment factor for wage linked totex"]
[null,null,null,null,{"$f":"Time!E$54","v":"Forecast Period Flag"},{"$f":"Time!F$54","v":0},{"$f":"Time!G$54","v":"flag"},{"$f":"Time!H$54","v":5},{"$f":"Time!I$54","v":0},{"$f":"Time!J$54","v":0},{"$f":"Time!K$54","v":1},{"$f":"Time!L$54","v":1},{"$f":"Time!M$54","v":1},{"$f":"Time!N$54","v":1},{"$f":"Time!O$54","v":1},{"$f":"Time!P$54","v":0}]
[null,null,null,null,{"$f":" E$240","v":"Profiled Net totex available for wage adj - WN - Real"},0,"£m",191.88987031140888,0,0,38.186084191970373,36.459075359167691,43.559000560689825,37.802304451347553,35.883405748233464,0]
[null,null,null,null,{"$f":" E$26","v":"Real adjustment factor for wages"},0,"%",0,0,0,1.0088717366571422,0.99546000675836432,0.97709431475246755,0.97400674149232291,0.96778371236795124,0]
[null,null,null,null,"Profiled adjustment wage related totex - WN - Real",null,"£m",{"$f":" SUM(J246:P246)","v":188.92673928946797},null,{"$f":" IF(J243 = 1, J244 * J245, 0)","v":0},38.524861074888996,36.293551403440787,42.56125180414957,36.819699379557761,34.727375627430867,0]
[]
[null,null,null,"Variance to forecast wage linked totex "]
[null,null,null,null,{"$f":" E$246","v":"Profiled adjustment wage related totex - WN - Real"},0,"£m",188.92673928946797,0,0,38.524861074888996,36.293551403440787,42.56125180414957,36.819699379557761,34.727375627430867,0]
[null,null,null,null,{"$f":" E$240","v":"Profiled Net totex available for wage adj - WN - Real"},0,"£m",191.88987031140888,0,0,38.186084191970373,36.459075359167691,43.559000560689825,37.802304451347553,35.883405748233464,0]
[null,null,null,null,"Variance to forecast totex for wage adjustment - WN",null,"£m",{"$f":" SUM(J251:P251)","v":-2.9631310219409244},null,{"$f":" J249 - J250","v":0},0.33877688291862285,-0.16552395572690415,-0.99774875654025408,-0.9826050717897914,-1.1560301208025976,0]
[]
[null,null,null,"Wage totex overfunded/unfunded at PR19"]
[null,null,null,null,{"$f":" E$251","v":"Variance to forecast totex for wage adjustment - WN"},{"$f":" F$251","v":0},"£m",-2.9631310219409244,0,0,0.33877688291862285,-0.16552395572690415,-0.99774875654025408,-0.9826050717897914,-1.1560301208025976,0]
[null,null,null,null,{"$f":"E303","v":"Time value of money factor - WN"},0,"Factor",0,0,1,{"$f":"K303","v":1.122016155346969},1.0901828170879997,1.0592526399999997,1.0291999999999999,1,1]
[null,null,null,null,"Variance to forecast totex for wage adjustment - NPV adjusted - WN",null,"£m",{"$f":" SUM(J256:P256)","v":-3.0245335017677544},null,{"$f":" J254*J255","v":0},{"$f":" K254*K255","v":0.38011313569278343},{"$f":" L254*L255","v":-0.18045137234990571},-1.0568680044219811,-1.0112971398860533,-1.1560301208025976,0]
[null,null,null,null,"(Under)/Overfunded wage related totex at PR19 - WN",{"$f":" H256 * -1","v":3.0245335017677544},"£m"]
[]
[]
[null,null,"Cost sharing on net totex available for reconciliation"]
[]
[null,null,null,null,{"$f":"InpActive!E$83","v":"Net totex for cost sharing reconciliation - WN  - Nominal"},{"$f":"InpActive!F$83","v":0},{"$f":"InpActive!G$83","v":"£m"},{"$f":"InpActive!H$83","v":0},{"$f":"InpActive!I$83","v":0},{"$f":"InpActive!J$83","v":0},{"$f":"InpActive!K$83","v":119.90600000000001},{"$f":"InpActive!L$83","v":118.23},{"$f":"InpActive!M$83","v":131.114},{"$f":"InpActive!N$83","v":137.23737317189844},{"$f":"InpActive!O$83","v":127.77413765953555},{"$f":"InpActive!P$83","v":0}]
[null,null,null,null,{"$f":"Index!E$43","v":"CPI(H): Fin year average - inflate from base year 2017-18 average - CALC"},{"$f":"Index!F$43","v":0},{"$f":"Index!G$43","v":"%"},{"$f":"Index!H$43","v":0},{"$f":"Index!I$43","v":0},{"$f":"Index!J$43","v":1.0386214616983847},{"$f":"Index!K$43","v":1.0469374700143934},{"$f":"Index!L$43","v":1.0853990084759317},{"$f":"Index!M$43","v":1.1806332960179113},{"$f":"Index!N$43","v":1.2461218615064769},{"$f":"Index!O$43","v":1.2831440908363987},{"$f":"Index!P$43","v":1.3134495442187752}]
[null,null,null,null,"Actual net totex for cost sharing reconciliation - WN - Real",null,"£m",null,null,{"$f":" J262 / J263","v":0},{"$f":" K262 / K263","v":114.53024028106618},{"$f":" L262 / L263","v":108.92768380727861},{"$f":" M262 / M263","v":111.0539576024382},{"$f":" N262 / N263","v":110.13158296251039},{"$f":" O262 / O263","v":99.57894719076161},{"$f":" P262 / P263","v":0}]
[]
[null,null,null,null,{"$f":"InpActive!E$85","v":"Performance related pay recovery mechanism adjustment  - WN - Nominal (Neg)"},{"$f":"InpActive!F$85","v":0},{"$f":"InpActive!G$85","v":"£m"},{"$f":"InpActive!H$85","v":0},{"$f":"InpActive!I$85","v":0},{"$f":"InpActive!J$85","v":0},{"$f":"InpActive!K$85","v":0},{"$f":"InpActive!L$85","v":0},{"$f":"InpActive!M$85","v":0},{"$f":"InpActive!N$85","v":0},{"$f":"InpActive!O$85","v":0},{"$f":"InpActive!P$85","v":0}]
[null,null,null,null,{"$f":"Index!E$43","v":"CPI(H): Fin year average - inflate from base year 2017-18 average - CALC"},{"$f":"Index!F$43","v":0},{"$f":"Index!G$43","v":"%"},{"$f":"Index!H$43","v":0},{"$f":"Index!I$43","v":0},{"$f":"Index!J$43","v":1.0386214616983847},{"$f":"Index!K$43","v":1.0469374700143934},{"$f":"Index!L$43","v":1.0853990084759317},{"$f":"Index!M$43","v":1.1806332960179113},{"$f":"Index!N$43","v":1.2461218615064769},{"$f":"Index!O$43","v":1.2831440908363987},{"$f":"Index!P$43","v":1.3134495442187752}]
[null,null,null,null,"Performance related pay recovery mechanism adjustment  - WN - real",null,"£m",{"$f":"SUM(K268:O268)","v":0},null,{"$f":" J266 / J267","v":0},{"$f":" K266 / K267","v":0},{"$f":" L266 / L267","v":0},0,0,0,0]
[null,null,null,null,"Total Performance related pay recovery mechanism adjustment  - WN - real",{"$f":"H268","v":0},"£m"]
[]
[null,null,null,null,{"$f":" E$264","v":"Actual net totex for cost sharing reconciliation - WN - Real"},{"$f":" F$264","v":0},"£m",0,0,0,114.53024028106618,108.92768380727861,111.0539576024382,110.13158296251039,99.57894719076161,0]
[null,null,null,null,{"$f":"E268","v":"Performance related pay recovery mechanism adjustment  - WN - real"},{"$f":"F268","v":0},"£m",0,0,0,0,0,0,0,0,0]
[null,null,null,null,{"$f":"Time!E$54","v":"Forecast Period Flag"},{"$f":"Time!F$54","v":0},{"$f":"Time!G$54","v":"flag"},{"$f":"Time!H$54","v":5},{"$f":"Time!I$54","v":0},{"$f":"Time!J$54","v":0},{"$f":"Time!K$54","v":1},{"$f":"Time!L$54","v":1},{"$f":"Time!M$54","v":1},{"$f":"Time!N$54","v":1},{"$f":"Time!O$54","v":1},{"$f":"Time!P$54","v":0}]
[null,null,null,null,"Actual net totex for cost sharing reconciliation - WN - Real",null,"£m",{"$f":" SUM(J274:P274)","v":544.22241184405493},null,{"$f":" (J271 + J272) * J273","v":0},{"$f":" (K271 + K272) * K273","v":114.53024028106618},{"$f":" (L271 + L272) * L273","v":108.92768380727861},111.0539576024382,110.13158296251039,99.57894719076161,0]
[]
[null,null,null,"Profile for net totex for cost sharing"]
[null,null,null,null,{"$f":"InpActive!E$76","v":"Opex split profile - Cost sharing - WN"},{"$f":"InpActive!F$76","v":0},{"$f":"InpActive!G$76","v":"%"},{"$f":"InpActive!H$76","v":0},{"$f":"InpActive!I$76","v":0},{"$f":"InpActive!J$76","v":0},{"$f":"InpActive!K$76","v":0.10838235493397499},{"$f":"InpActive!L$76","v":0.10918691408859872},{"$f":"InpActive!M$76","v":0.11014546173903282},{"$f":"InpActive!N$76","v":0.11139290405029334},{"$f":"InpActive!O$76","v":0.11294989161994552},{"$f":"InpActive!P$76","v":0}]
[null,null,null,null,{"$f":"InpActive!E$77","v":"Capex split profile - Cost sharing - WN"},{"$f":"InpActive!F$77","v":0},{"$f":"InpActive!G$77","v":"%"},{"$f":"InpActive!H$77","v":0},{"$f":"InpActive!I$77","v":0},{"$f":"InpActive!J$77","v":0},{"$f":"InpActive!K$77","v":8.6688167561688817E-2},{"$f":"InpActive!L$77","v":8.0230489286152756E-2},{"$f":"InpActive!M$77","v":0.1220977208511322},{"$f":"InpActive!N$77","v":8.5655435505242808E-2},{"$f":"InpActive!O$77","v":7.3270660363937964E-2},{"$f":"InpActive!P$77","v":0}]
[null,null,null,null,"Totex profile - Cost Sharing - WN",null,"%",{"$f":" SUM(J279:P279)","v":1},null,{"$f":" SUM(J277:J278)","v":0},0.19507052249566381,0.18941740337475149,0.23224318259016502,0.19704833955553613,0.18622055198388349,0]
[null,null,null,null,"Totex profile - Cost Sharing - 5 year percentage - WN",{"$f":"H$226","v":1},"%"]
[]
[null,null,null,null,{"$f":" E$227","v":"Totex profile - Base costs - 5 year percentage - WN"},{"$f":" F$227","v":1},{"$f":" G$227","v":"%"}]
[null,null,null,null,"WN Totex profile - Cost Sharing 100% check",{"$f":" IF(OR($F$282 = 1, F282 = 0), 0, 1)","v":0},"Check"]
[]
[null,null,null,null,{"$f":"InpActive!E$84","v":"Net totex available for cost sharing - WN  - Real"},{"$f":"InpActive!F$84","v":438.4},{"$f":"InpActive!G$84","v":"£m"}]
[null,null,null,null,{"$f":" E$279","v":"Totex profile - Cost Sharing - WN"},{"$f":" F$279","v":0},"%",1,0,0,0.19507052249566381,0.18941740337475149,0.23224318259016502,0.19704833955553613,0.18622055198388349,0]
[null,null,null,null,"Net totex available for cost sharing profiled - WN - Real",null,"£m",{"$f":" SUM(J287:P287)","v":438.4},null,{"$f":" J286 * $F285","v":0},85.518917062099007,83.040589639491046,101.81541124752835,86.385992061147036,81.639089989734515,0]
[]
[null,null,null,null,{"$f":"E$287","v":"Net totex available for cost sharing profiled - WN - Real"},{"$f":"F$287","v":0},"£m",438.4,0,0,85.518917062099007,83.040589639491046,101.81541124752835,86.385992061147036,81.639089989734515,0]
[null,null,null,null,{"$f":" E$251","v":"Variance to forecast totex for wage adjustment - WN"},0,"£m",-2.9631310219409244,0,0,0.33877688291862285,-0.16552395572690415,-0.99774875654025408,-0.9826050717897914,-1.1560301208025976,0]
[null,null,null,null,{"$f":"InpActive!E$87","v":"Total final WINEP reconciliation - WN - real"},{"$f":"InpActive!F$87","v":0},{"$f":"InpActive!G$87","v":"£m"},{"$f":"InpActive!H$87","v":0},{"$f":"InpActive!I$87","v":0},{"$f":"InpActive!J$87","v":0},{"$f":"InpActive!K$87","v":0},{"$f":"InpActive!L$87","v":0},{"$f":"InpActive!M$87","v":0},{"$f":"InpActive!N$87","v":0},{"$f":"InpActive!O$87","v":0},{"$f":"InpActive!P$87","v":0}]
[null,null,null,null,{"$f":"E268","v":"Performance related pay recovery mechanism adjustment  - WN - real"},{"$f":"F268","v":0},"£m",0,0,0,0,0,0,0,0,0]
[null,null,null,null,"Net totex available for cost sharing after adjustments profiled - WN - Real",null,"£m",{"$f":" SUM(J293:P293)","v":435.43686897805901},null,{"$f":"SUM(J289:J292)","v":0},{"$f":"SUM(K289:K292)","v":85.85769394501763},{"$f":"SUM(L289:L292)","v":82.875065683764149},{"$f":"SUM(M289:M292)","v":100.81766249098808},85.403386989357244,80.483059868931917,0]
[]
[null,null,null,"Variance to forecast net totex for cost sharing"]
[null,null,null,null,{"$f":" E$274","v":"Actual net totex for cost sharing reconciliation - WN - Real"},0,"£m",544.22241184405493,0,0,114.53024028106618,108.92768380727861,111.0539576024382,110.13158296251039,99.57894719076161,0]
[null,null,null,null,{"$f":" E$293","v":"Net totex available for cost sharing after adjustments profiled - WN - Real"},0,"£m",435.43686897805901,0,0,85.85769394501763,82.875065683764149,100.81766249098808,85.403386989357244,80.483059868931917,0]
[null,null,null,null,"Variance to forecast net totex for cost sharing - WN",null,"£m",{"$f":" SUM(J298:P298)","v":108.78554286599598},null,{"$f":" J296 - J297","v":0},28.672546336048555,26.052618123514463,10.236295111450119,24.728195973153149,19.095887321829693,0]
[]
[null,null,null,"Variance to forecast net totex for cost sharing - Time adjusted"]
[null,null,null,null,{"$f":" InpActive!E$288","v":"Financing cost index"},{"$f":" InpActive!F$288","v":0},{"$f":" InpActive!G$288","v":"Index"},{"$f":" InpActive!H$288","v":0},{"$f":" InpActive!I$288","v":0},{"$f":" InpActive!J$288","v":0},{"$f":" InpActive!K$288","v":4},{"$f":" InpActive!L$288","v":3},{"$f":" InpActive!M$288","v":2},{"$f":" InpActive!N$288","v":1},{"$f":" InpActive!O$288","v":0},{"$f":" InpActive!P$288","v":0}]
[null,null,null,null,{"$f":" InpActive!E$291","v":"Real WACC CPIH Deflated - WN"},{"$f":" InpActive!F$291","v":2.92E-2},{"$f":" InpActive!G$291","v":"%"}]
[null,null,null,null,"Time value of money factor - WN",null,"Factor",null,null,{"$f":"(1+$F302) ^ J301","v":1},1.122016155346969,1.0901828170879997,1.0592526399999997,1.0291999999999999,1,1]
[]
[null,null,null,null,{"$f":" E$298","v":"Variance to forecast net totex for cost sharing - WN"},0,"£m",108.78554286599598,0,0,28.672546336048555,26.052618123514463,10.236295111450119,24.728195973153149,19.095887321829693,0]
[null,null,null,null,{"$f":" E$303","v":"Time value of money factor - WN"},0,"Factor",0,0,1,1.122016155346969,1.0901828170879997,1.0592526399999997,1.0291999999999999,1,1]
[null,null,null,null,"Time adjusted variance to forecast net totex for cost sharing - WN",null,"£m",{"$f":" SUM(J307:P307)","v":115.96214606041345},null,{"$f":" J305 * J306","v":0},32.171060203981021,28.402116618410872,10.842822620622631,25.450259295569218,19.095887321829693,0]
[null,null,null,null,"Total variance to forecast net totex for cost sharing - WN",{"$f":" $H307","v":115.96214606041345},"£m"]
[]
[null,null,null,"Under / Overperformance on net totex for cost sharing"]
[null,null,null,null,{"$f":"E308","v":"Total variance to forecast net totex for cost sharing - WN"},{"$f":"F308","v":115.96214606041345},{"$f":"G308","v":"£m"}]
[null,null,null,null,{"$f":"E$45","v":"Active Sharing Rate - Underperformance Rate - WN"},{"$f":"F$45","v":0.56136463318819474},{"$f":"G$45","v":"%"}]
[null,null,null,null,"Active adjustment for cost sharing - Net totex for cost sharing - WN - Real",{"$f":" F311 * (1-F312)","v":50.865098473493589},"£m"]
[]
[null,null,null,null,{"$f":" InpActive!E$98","v":"Ex ante allowance above Ofwat forecast  - Water Network - Real"},{"$f":" InpActive!F$98","v":0},{"$f":" InpActive!G$98","v":"£m"}]
[null,null,null,null,{"$f":" E$279","v":"Totex profile - Cost Sharing - WN"},{"$f":" F$279","v":0},"%",1,0,0,0.19507052249566381,0.18941740337475149,0.23224318259016502,0.19704833955553613,0.18622055198388349,0]
[null,null,null,null,"Ex ante allowance profiled - WN - Real",null,"£m",{"$f":" SUM(J317:P317)","v":0},null,{"$f":" J316 * $F315","v":0},0,0,0,0,0,0]
[]
[null,null,null,null,{"$f":" E$317","v":"Ex ante allowance profiled - WN - Real"},0,"£m",0,0,0,0,0,0,0,0,0]
[null,null,null,null,{"$f":" E$303","v":"Time value of money factor - WN"},0,"Factor",0,0,1,1.122016155346969,1.0901828170879997,1.0592526399999997,1.0291999999999999,1,1]
[null,null,null,null,"Ex ante allowance profiled - WN - Real - NPV adjusted",null,"£m",{"$f":" SUM(J321:P321)","v":0},null,{"$f":" J319 * J320","v":0},0,0,0,0,0,0]
[null,null,null,null,"NPV adjusted ex ante allowance - WN - Real",{"$f":" H321","v":0},"£m"]
[]
[null,null,null,null,{"$f":"InpActive!E$105","v":"Actuals for CMA excluded items - WN - nominal"},{"$f":"InpActive!F$105","v":0},{"$f":"InpActive!G$105","v":"£m"},{"$f":"InpActive!H$105","v":0},{"$f":"InpActive!I$105","v":0},{"$f":"InpActive!J$105","v":0},{"$f":"InpActive!K$105","v":0},{"$f":"InpActive!L$105","v":0},{"$f":"InpActive!M$105","v":0},{"$f":"InpActive!N$105","v":0},{"$f":"InpActive!O$105","v":0},{"$f":"InpActive!P$105","v":0}]
[null,null,null,null,{"$f":"Index!E$43","v":"CPI(H): Fin year average - inflate from base year 2017-18 average - CALC"},{"$f":"Index!F$43","v":0},{"$f":"Index!G$43","v":"%"},{"$f":"Index!H$43","v":0},{"$f":"Index!I$43","v":0},{"$f":"Index!J$43","v":1.0386214616983847},{"$f":"Index!K$43","v":1.0469374700143934},{"$f":"Index!L$43","v":1.0853990084759317},{"$f":"Index!M$43","v":1.1806332960179113},{"$f":"Index!N$43","v":1.2461218615064769},{"$f":"Index!O$43","v":1.2831440908363987},{"$f":"Index!P$43","v":1.3134495442187752}]
[null,null,null,null,"Actuals for CMA excluded items - WN - real",null,"£m",null,null,{"$f":" J324 / J325","v":0},{"$f":" K324 / K325","v":0},{"$f":" L324 / L325","v":0},0,0,0,0]
[]
[null,null,null,null,{"$f":"InpActive!E$106","v":"Allowance for CMA excluded items - WN - real"},{"$f":"InpActive!F$106","v":0},{"$f":"InpActive!G$106","v":"£m"},{"$f":"InpActive!H$106","v":0},{"$f":"InpActive!I$106","v":0},{"$f":"InpActive!J$106","v":0},{"$f":"InpActive!K$106","v":0},{"$f":"InpActive!L$106","v":0},{"$f":"InpActive!M$106","v":0},{"$f":"InpActive!N$106","v":0},{"$f":"InpActive!O$106","v":0},{"$f":"InpActive!P$106","v":0}]
[null,null,null,null,{"$f":"E326","v":"Actuals for CMA excluded items - WN - real"},{"$f":"F326","v":0},"£m",0,0,0,{"$f":"K326","v":0},{"$f":"L326","v":0},0,0,0,0]
[null,null,null,null,"Variance to allowances for CMA excluded items - WN - real",null,"£m",{"$f":" SUM(J330:P330)","v":0},null,{"$f":"J329-J328","v":0},{"$f":"K329-K328","v":0},{"$f":"L329-L328","v":0},0,0,0,0]
[]
[]
[null,null,null,null,{"$f":" E$330","v":"Variance to allowances for CMA excluded items - WN - real"},{"$f":" F$330","v":0},"£m",0,0,{"$f":" J$330","v":0},0,0,0,0,0,0]
[null,null,null,null,{"$f":" E$303","v":"Time value of money factor - WN"},0,"Factor",0,0,1,1.122016155346969,1.0901828170879997,1.0592526399999997,1.0291999999999999,1,1]
[null,null,null,null,"Time value adjusted variance to allowances for CMA excluded items - WN - real",null,"£m",{"$f":" SUM(J335:P335)","v":0},null,{"$f":" J333 * J334","v":0},0,0,0,0,0,0]
[null,null,null,null,"Total variance to allowances for CMA excluded items - WN - real",{"$f":" $H335","v":0},"£m"]
[]
[null,null,null,null,{"$f":"E336","v":"Total variance to allowances for CMA excluded items - WN - real"},{"$f":"F336","v":0},"£m"]
[null,null,null,null,{"$f":"InpActive!E107","v":"CMA excluded items sharing rate - WN - real"},{"$f":"InpActive!F107","v":0},{"$f":"InpActive!G107","v":"%"}]
[null,null,null,null,"Allowable adjustment for CMA excluded items - WN - Real",{"$f":"(F338* F339) * -1","v":0},"£m"]
[]
[null,null,null,null,{"$f":"E313","v":"Active adjustment for cost sharing - Net totex for cost sharing - WN - Real"},{"$f":"F313","v":50.865098473493589},{"$f":"G313","v":"£m"}]
[null,null,null,null,{"$f":" E$322","v":"NPV adjusted ex ante allowance - WN - Real"},{"$f":" F$322","v":0},{"$f":" G$322","v":"£m"}]
[null,null,null,null,{"$f":"E257","v":"(Under)/Overfunded wage related totex at PR19 - WN"},{"$f":"F257","v":3.0245335017677544},{"$f":"G257","v":"£m"}]
[null,null,null,null,{"$f":"E340","v":"Allowable adjustment for CMA excluded items - WN - Real"},{"$f":"F340","v":0},"£m"]
[null,null,null,null,{"$f":"E269","v":"Total Performance related pay recovery mechanism adjustment  - WN - real"},{"$f":"F269","v":0},"£m"]
[null,null,null,null,"Total adjustment for cost sharing after ex ante allowance - WN - Real",{"$f":" F342 - SUM(F343:F345) + F346","v":47.840564971725833},"£m"]
[]
[null,null,"Wholesaler bad debt sharing adjustment"]
[]
[null,null,null,null,{"$f":" InpActive!E$101","v":"Business retail bad debt liability due to covid liquidity measures - WN - real"},{"$f":" InpActive!F$101","v":0},{"$f":" InpActive!G$101","v":"£m"}]
[null,null,null,null,{"$f":"E$45","v":"Active Sharing Rate - Underperformance Rate - WN"},{"$f":"F$45","v":0.56136463318819474},{"$f":"G$45","v":"%"}]
[null,null,null,null,"Embedded customer share - WN",{"$f":" F351 * (1-F352)","v":0},"£m"]
[]
[null,null,null,null,{"$f":" InpActive!E$102","v":"Total Wholesaler Liability - WN - real"},{"$f":" InpActive!F$102","v":0},{"$f":" InpActive!G$102","v":"£m"}]
[null,null,null,null,{"$f":"E$45","v":"Active Sharing Rate - Underperformance Rate - WN"},{"$f":"F$45","v":0.56136463318819474},{"$f":"G$45","v":"%"}]
[null,null,null,null,"Wholesaler liability - WN",{"$f":" F355 * (F356)","v":0},"£m"]
[]
[null,null,null,null,{"$f":" InpActive!E$101","v":"Business retail bad debt liability due to covid liquidity measures - WN - real"},{"$f":" InpActive!F$101","v":0},{"$f":" InpActive!G$101","v":"£m"}]
[null,null,null,null,{"$f":" E$357","v":"Wholesaler liability - WN"},{"$f":" F$357","v":0},"£m"]
[null,null,null,null,"Customer Liability",{"$f":" F359 - F360","v":0},"£m"]
[]
[null,null,null,null,{"$f":" E361","v":"Customer Liability"},{"$f":" F361","v":0},"£m"]
[null,null,null,null,{"$f":"E353","v":"Embedded customer share - WN"},{"$f":"F353","v":0},"£m"]
[null,null,null,null,"Wholesaler bad debt adjustment - WN",{"$f":" IF(F363 > F364, F363 - F364, 0)","v":0},"£m"]
[]
[null,null,"Cost sharing adjustment RCV/Revenue Split"]
[]
[null,null,null,null,{"$f":" E$347","v":"Total adjustment for cost sharing after ex ante allowance - WN - Real"},{"$f":" F$347","v":47.840564971725833},"£m"]
[null,null,null,null,{"$f":"InpActive!E$96","v":"Weighted average PAYG rate - WN"},{"$f":"InpActive!F$96","v":0.72199999999999998},{"$f":"InpActive!G$96","v":"%"}]
[null,null,null,null,"Cost sharing revenue exc bad debt adjustment- WN - Real",{"$f":" F369 * $F$370","v":34.540887909586047},"£m"]
[]
[null,null,null,null,{"$f":" E371","v":"Cost sharing revenue exc bad debt adjustment- WN - Real"},{"$f":" F371","v":34.540887909586047},"£m"]
[null,null,null,null,{"$f":"E365","v":"Wholesaler bad debt adjustment - WN"},{"$f":"F365","v":0},"£m"]
[null,null,null,null,"Cost sharing revenue adjustment - WN - Real",{"$f":" SUM(F373:F374)","v":34.540887909586047},"£m"]
[]
[null,null,null,null,{"$f":" E$347","v":"Total adjustment for cost sharing after ex ante allowance - WN - Real"},{"$f":" F$347","v":47.840564971725833},"£m"]
[null,null,null,null,{"$f":"InpActive!E$96","v":"Weighted average PAYG rate - WN"},{"$f":"InpActive!F$96","v":0.72199999999999998},{"$f":"InpActive!G$96","v":"%"}]
[null,null,null,null,"Cost sharing RCV adjustment - WN - Real",{"$f":" F377 * (1 - $F$378)","v":13.299677062139782},"£m"]
[]
["WASTEWATER NETWORK"]
[]
[null,null,"Adjustment For Wage Growth"]
[]
[null,null,null,"Totex for wage adjustment"]
[null,null,null,null,{"$f":" InpActive!E$111","v":"Base Costs - WWN - Real"},{"$f":" InpActive!F$111","v":884.6},{"$f":" InpActive!G$111","v":"£m"}]
[null,null,null,null,{"$f":" InpActive!E$112","v":"Metering (excluding new connections) for meters requested by optants, customers and businesses - WWN - Real"},{"$f":" InpActive!F$112","v":0},{"$f":" InpActive!G$112","v":"£m"}]
[null,null,null,null,{"$f":" InpActive!E$113","v":"WINEP / NEP ~ In-the-Round - WWN - Real"},{"$f":" InpActive!F$113","v":384.1},{"$f":" InpActive!G$113","v":"£m"}]
[null,null,null,null,"Totex available for wage indexation adjustment - WWN - Real",{"$f":" SUM(F386:F388)","v":1268.7},"£m"]
[]
[null,null,null,"Profile for totex for wage adjustment"]
[null,null,null,null,{"$f":"InpActive!E$115","v":"Opex Split Profile - Base costs - WWN"},{"$f":"InpActive!F$115","v":0},{"$f":"InpActive!G$115","v":"%"},{"$f":"InpActive!H$115","v":0},{"$f":"InpActive!I$115","v":0},{"$f":"InpActive!J$115","v":0},{"$f":"InpActive!K$115","v":0.09},{"$f":"InpActive!L$115","v":9.0999999999999998E-2},{"$f":"InpActive!M$115","v":9.1999999999999998E-2},{"$f":"InpActive!N$115","v":9.2999999999999999E-2},{"$f":"InpActive!O$115","v":9.4E-2},{"$f":"InpActive!P$115","v":0}]
[null,null,null,null,{"$f":"InpActive!E$116","v":"Capex Split Profile - Base costs - WWN"},{"$f":"InpActive!F$116","v":0},{"$f":"InpActive!G$116","v":"%"},{"$f":"InpActive!H$116","v":0},{"$f":"InpActive!I$116","v":0},{"$f":"InpActive!J$116","v":0},{"$f":"InpActive!K$116","v":0.1},{"$f":"InpActive!L$116","v":0.108},{"$f":"InpActive!M$116","v":0.109},{"$f":"InpActive!N$116","v":0.114},{"$f":"InpActive!O$116","v":0.108},{"$f":"InpActive!P$116","v":0}]
[null,null,null,null,"Totex profile - WWN",null,"%",{"$f":" SUM(J394:P394)","v":0.99900000000000011},null,{"$f":" SUM(J392:J393)","v":0},0.19,0.19900000000000001,0.20100000000000001,0.20700000000000002,0.20200000000000001,0]
[null,null,null,null,"Totex profile - 5 year percentage - WWN",{"$f":"H$226","v":1},"%"]
[]
[null,null,null,null,{"$f":" E$395","v":"Totex profile - 5 year percentage - WWN"},{"$f":" F$395","v":1},{"$f":" G$395","v":"%"}]
[null,null,null,null,"WWN Totex profile 100% check",{"$f":" IF(OR($F$397 = 1, F397 = 0), 0, 1)","v":0},"Check"]
[]
[null,null,null,null,{"$f":" E$389","v":"Totex available for wage indexation adjustment - WWN - Real"},{"$f":" F$389","v":1268.7},{"$f":" G$389","v":"£m"}]
[null,null,null,null,{"$f":"Time!E$54","v":"Forecast Period Flag"},{"$f":"Time!F$54","v":0},{"$f":"Time!G$54","v":"flag"},{"$f":"Time!H$54","v":5},{"$f":"Time!I$54","v":0},{"$f":"Time!J$54","v":0},{"$f":"Time!K$54","v":1},{"$f":"Time!L$54","v":1},{"$f":"Time!M$54","v":1},{"$f":"Time!N$54","v":1},{"$f":"Time!O$54","v":1},{"$f":"Time!P$54","v":0}]
[null,null,null,null,{"$f":" E$394","v":"Totex profile - WWN"},0,"%",0.99900000000000011,0,0,0.19,0.19900000000000001,0.20100000000000001,0.20700000000000002,0.20200000000000001,0]
[null,null,null,null,"Profiled Totex available for wage indexation adjustment - WWN - Real",null,"£m",{"$f":" SUM(J403:P403)","v":1267.4313000000002},null,{"$f":" IF(J401 = 1, J402 * $F400, 0)","v":0},241.053,252.47130000000001,255.00870000000003,262.62090000000001,256.2774,0]
[]
[null,null,null,"Totex applicable for wage adjustment by year"]
[null,null,null,null,{"$f":"InpActive!E$257","v":"Percentage totex linked to wage growth - WWN"},{"$f":"InpActive!F$257","v":0.38600000000000001},{"$f":"InpActive!G$257","v":"%"}]
[null,null,null,null,{"$f":"E403","v":"Profiled Totex available for wage indexation adjustment - WWN - Real"},0,"£m",1267.4313000000002,0,0,{"$f":"K403","v":241.053},252.47130000000001,255.00870000000003,262.62090000000001,256.2774,0]
[null,null,null,null,"Profiled Net totex available for wage adj - WWN - Real",null,"£m",{"$f":" SUM(J408:P408)","v":489.22848180000005},null,{"$f":" J407 * $F406","v":0},{"$f":" K407 * $F406","v":93.046458000000001},97.453921800000003,98.433358200000015,101.37166740000001,98.923076399999999,0]
[]
[null,null,null,"Adjustment factor for wage linked totex"]
[null,null,null,null,{"$f":"Time!E$54","v":"Forecast Period Flag"},{"$f":"Time!F$54","v":0},{"$f":"Time!G$54","v":"flag"},{"$f":"Time!H$54","v":5},{"$f":"Time!I$54","v":0},{"$f":"Time!J$54","v":0},{"$f":"Time!K$54","v":1},{"$f":"Time!L$54","v":1},{"$f":"Time!M$54","v":1},{"$f":"Time!N$54","v":1},{"$f":"Time!O$54","v":1},{"$f":"Time!P$54","v":0}]
[null,null,null,null,{"$f":" E$408","v":"Profiled Net totex available for wage adj - WWN - Real"},{"$f":" F$408","v":0},"£m",489.22848180000005,0,0,93.046458000000001,97.453921800000003,98.433358200000015,101.37166740000001,98.923076399999999,0]
[null,null,null,null,{"$f":" E$26","v":"Real adjustment factor for wages"},0,"%",0,0,0,1.0088717366571422,0.99546000675836432,0.97709431475246755,0.97400674149232291,0.96778371236795124,0]
[null,null,null,null,"Profiled adjustment wage related totex - WWN - Real",null,"£m",{"$f":" SUM(J414:P414)","v":481.53492756629419},null,{"$f":" IF(J411 = 1, J412 * J413, 0)","v":0},93.871941672255844,97.011481653657114,96.178674679213202,98.736687443917546,95.736142117250466,0]
[]
[null,null,null,"Variance to forecast wage linked totex "]
[null,null,null,null,{"$f":" E$414","v":"Profiled adjustment wage related totex - WWN - Real"},0,"£m",481.53492756629419,0,0,93.871941672255844,97.011481653657114,96.178674679213202,98.736687443917546,95.736142117250466,0]
[null,null,null,null,{"$f":" E$408","v":"Profiled Net totex available for wage adj - WWN - Real"},{"$f":" F$408","v":0},"£m",489.22848180000005,0,0,93.046458000000001,97.453921800000003,98.433358200000015,101.37166740000001,98.923076399999999,0]
[null,null,null,null,"Variance to forecast totex for wage adjustment- WWN",null,"£m",{"$f":" SUM(J419:P419)","v":-7.6935542337058536},null,{"$f":" J417 - J418","v":0},0.82548367225584229,-0.44244014634288931,-2.2546835207868128,-2.6349799560824607,-3.1869342827495331,0]
[]
[null,null,null,"Wage totex overfunded/unfunded at PR19"]
[null,null,null,null,{"$f":" E$419","v":"Variance to forecast totex for wage adjustment- WWN"},{"$f":" F$419","v":0},"£m",-7.6935542337058536,0,0,0.82548367225584229,-0.44244014634288931,-2.2546835207868128,-2.6349799560824607,-3.1869342827495331,0]
[null,null,null,null,{"$f":"E471","v":"Time value of money factor - WWN"},0,"Factor",0,0,1,{"$f":"K471","v":1.122016155346969},1.0901828170879997,1.0592526399999997,1.0291999999999999,1,1]
[null,null,null,null,"Variance to forecast totex for wage adjustment - NPV adjusted - WWN",null,"£m",{"$f":" SUM(J424:P424)","v":-7.8432697541942478},null,{"$f":" J422*J423","v":0},{"$f":" K422*K423","v":0.92620601624619758},{"$f":" L422*L423","v":-0.48234064513291791},-2.3882794717579259,-2.7119213708000682,-3.1869342827495331,0]
[null,null,null,null,"(Under)/Overfunded wage related totex at PR19 - WWN",{"$f":" H424 * -1","v":7.8432697541942478},"£m"]
[]
[]
[null,null,"Cost sharing on net totex available for reconciliation"]
[]
[null,null,null,null,{"$f":"InpActive!E$124","v":"Net totex for cost sharing reconciliation - WWN - nominal"},{"$f":"InpActive!F$124","v":0},{"$f":"InpActive!G$124","v":"£m"},{"$f":"InpActive!H$124","v":0},{"$f":"InpActive!I$124","v":0},{"$f":"InpActive!J$124","v":0},{"$f":"InpActive!K$124","v":237.078},{"$f":"InpActive!L$124","v":235.87300000000002},{"$f":"InpActive!M$124","v":262.85399999999998},{"$f":"InpActive!N$124","v":356.47937337486906},{"$f":"InpActive!O$124","v":377.67601618112207},{"$f":"InpActive!P$124","v":0}]
[null,null,null,null,{"$f":"Index!E$43","v":"CPI(H): Fin year average - inflate from base year 2017-18 average - CALC"},{"$f":"Index!F$43","v":0},{"$f":"Index!G$43","v":"%"},{"$f":"Index!H$43","v":0},{"$f":"Index!I$43","v":0},{"$f":"Index!J$43","v":1.0386214616983847},{"$f":"Index!K$43","v":1.0469374700143934},{"$f":"Index!L$43","v":1.0853990084759317},{"$f":"Index!M$43","v":1.1806332960179113},{"$f":"Index!N$43","v":1.2461218615064769},{"$f":"Index!O$43","v":1.2831440908363987},{"$f":"Index!P$43","v":1.3134495442187752}]
[null,null,null,null,"Actual net totex for cost sharing reconciliation - WWN - Real",null,"£m",null,null,{"$f":" J430 / J431","v":0},226.44905430382641,217.31455267423013,222.63813911276668,286.07103718083368,294.33640296386312,0]
[]
[null,null,null,null,{"$f":"InpActive!E$126","v":"Performance related pay recovery mechanism adjustment  - WWN - Nominal (Neg)"},{"$f":"InpActive!F$126","v":0},{"$f":"InpActive!G$126","v":"£m"},{"$f":"InpActive!H$126","v":0},{"$f":"InpActive!I$126","v":0},{"$f":"InpActive!J$126","v":0},{"$f":"InpActive!K$126","v":0},{"$f":"InpActive!L$126","v":0},{"$f":"InpActive!M$126","v":0},{"$f":"InpActive!N$126","v":0},{"$f":"InpActive!O$126","v":0},{"$f":"InpActive!P$126","v":0}]
[null,null,null,null,{"$f":"Index!E$43","v":"CPI(H): Fin year average - inflate from base year 2017-18 average - CALC"},{"$f":"Index!F$43","v":0},{"$f":"Index!G$43","v":"%"},{"$f":"Index!H$43","v":0},{"$f":"Index!I$43","v":0},{"$f":"Index!J$43","v":1.0386214616983847},{"$f":"Index!K$43","v":1.0469374700143934},{"$f":"Index!L$43","v":1.0853990084759317},{"$f":"Index!M$43","v":1.1806332960179113},{"$f":"Index!N$43","v":1.2461218615064769},{"$f":"Index!O$43","v":1.2831440908363987},{"$f":"Index!P$43","v":1.3134495442187752}]
[null,null,null,null,"Performance related pay recovery mechanism adjustment  - WWN - real",null,"£m",{"$f":"SUM(K436:O436)","v":0},null,{"$f":" J434 / J435","v":0},{"$f":" K434 / K435","v":0},{"$f":" L434 / L435","v":0},0,0,0,0]
[null,null,null,null,"Total Performance related pay recovery mechanism adjustment  - WWN - real",{"$f":"H436","v":0},"£m"]
[]
[null,null,null,null,{"$f":"E$432","v":"Actual net totex for cost sharing reconciliation - WWN - Real"},0,"£m",0,0,0,226.44905430382641,217.31455267423013,222.63813911276668,286.07103718083368,294.33640296386312,0]
[null,null,null,null,{"$f":"E436","v":"Performance related pay recovery mechanism adjustment  - WWN - real"},{"$f":"F436","v":0},"£m",0,0,0,0,0,0,0,0,0]
[null,null,null,null,{"$f":"Time!E$54","v":"Forecast Period Flag"},{"$f":"Time!F$54","v":0},{"$f":"Time!G$54","v":"flag"},{"$f":"Time!H$54","v":5},{"$f":"Time!I$54","v":0},{"$f":"Time!J$54","v":0},{"$f":"Time!K$54","v":1},{"$f":"Time!L$54","v":1},{"$f":"Time!M$54","v":1},{"$f":"Time!N$54","v":1},{"$f":"Time!O$54","v":1},{"$f":"Time!P$54","v":0}]
[null,null,null,null,"Actual net totex for cost sharing reconciliation - WWN - Real",null,"£m",{"$f":" SUM(J442:P442)","v":1246.80918623552},null,{"$f":" (J439 + J440) * J441","v":0},{"$f":" (K439 + K440) * K441","v":226.44905430382641},217.31455267423013,222.63813911276668,286.07103718083368,294.33640296386312,0]
[]
[null,null,null,"Profile for net totex for cost sharing"]
[null,null,null,null,{"$f":"InpActive!E$118","v":"Opex split profile - Cost sharing - WWN"},{"$f":"InpActive!F$118","v":0},{"$f":"InpActive!G$118","v":"%"},{"$f":"InpActive!H$118","v":0},{"$f":"InpActive!I$118","v":0},{"$f":"InpActive!J$118","v":0},{"$f":"InpActive!K$118","v":5.9615152338105527E-2},{"$f":"InpActive!L$118","v":6.0976521058959891E-2},{"$f":"InpActive!M$118","v":6.2824376140327529E-2},{"$f":"InpActive!N$118","v":6.5202311377984615E-2},{"$f":"InpActive!O$118","v":6.6960861971282939E-2},{"$f":"InpActive!P$118","v":0}]
[null,null,null,null,{"$f":"InpActive!E$119","v":"Capex split profile - Cost sharing - WWN"},{"$f":"InpActive!F$119","v":0},{"$f":"InpActive!G$119","v":"%"},{"$f":"InpActive!H$119","v":0},{"$f":"InpActive!I$119","v":0},{"$f":"InpActive!J$119","v":0},{"$f":"InpActive!K$119","v":0.15578428132538608},{"$f":"InpActive!L$119","v":0.14056469524624932},{"$f":"InpActive!M$119","v":0.13647139020219906},{"$f":"InpActive!N$119","v":0.13120537961380574},{"$f":"InpActive!O$119","v":0.12039503072569935},{"$f":"InpActive!P$119","v":0}]
[null,null,null,null,"Totex profile - Cost Sharing - WWN",null,"%",{"$f":" SUM(J447:P447)","v":1},null,{"$f":" SUM(J445:J446)","v":0},0.2153994336634916,0.20154121630520921,0.1992957663425266,0.19640769099179034,0.18735589269698227,0]
[null,null,null,null,"Totex profile - Cost Sharing - 5 year percentage - WWN",{"$f":"H$447","v":1},"%"]
[]
[null,null,null,null,{"$f":" E$448","v":"Totex profile - Cost Sharing - 5 year percentage - WWN"},{"$f":" F$448","v":1},{"$f":" G$448","v":"%"}]
[null,null,null,null,"WWN Totex profile - Cost Sharing 100% check",{"$f":" IF(OR($F$450 = 1, F450 = 0), 0, 1)","v":0},"Check"]
[]
[null,null,null,null,{"$f":"InpActive!E$125","v":"Net totex available for cost sharing - WWN - Real"},{"$f":"InpActive!F$125","v":1237.0999999999999},{"$f":"InpActive!G$125","v":"£m"}]
[null,null,null,null,{"$f":" E$447","v":"Totex profile - Cost Sharing - WWN"},0,"%",1,0,0,0.2153994336634916,0.20154121630520921,0.1992957663425266,0.19640769099179034,0.18735589269698227,0]
[null,null,null,null,"Net totex available for cost sharing profiled - WWN - Real",null,"£m",{"$f":" SUM(J455:P455)","v":1237.1000000000001},null,{"$f":" J454 * $F453","v":0},266.47063938510541,249.32663869117431,246.54879254233964,242.97595452594382,231.77797485543675,0]
[]
[null,null,null,null,{"$f":"E$455","v":"Net totex available for cost sharing profiled - WWN - Real"},0,"£m",1237.1000000000001,0,0,266.47063938510541,249.32663869117431,246.54879254233964,242.97595452594382,231.77797485543675,0]
[null,null,null,null,{"$f":" E$419","v":"Variance to forecast totex for wage adjustment- WWN"},0,"£m",-7.6935542337058536,0,0,0.82548367225584229,-0.44244014634288931,-2.2546835207868128,-2.6349799560824607,-3.1869342827495331,0]
[null,null,null,null,{"$f":"InpActive!E$128","v":"Total final WINEP reconciliation - WWN - real"},{"$f":"InpActive!F$128","v":0},{"$f":"InpActive!G$128","v":"£m"},{"$f":"InpActive!H$128","v":0},{"$f":"InpActive!I$128","v":0},{"$f":"InpActive!J$128","v":0},{"$f":"InpActive!K$128","v":0},{"$f":"InpActive!L$128","v":0},{"$f":"InpActive!M$128","v":-0.21525573333333334},{"$f":"InpActive!N$128","v":-0.21525573333333334},{"$f":"InpActive!O$128","v":-0.21525573333333334},{"$f":"InpActive!P$128","v":0}]
[null,null,null,null,{"$f":"E436","v":"Performance related pay recovery mechanism adjustment  - WWN - real"},0,"£m",0,0,0,0,0,0,0,0,0,0,0,0,0,0,0,0,0,0,0,0,0,0,0,0,0,0,0,0,0,0,0,0,0,0,0,0,0,0,0,0,0,0,0,0,0,0,0,0,0,0,0,0,0,0,0,0,0,0,0,0,0,{"$f":"BQ436","v":0},0,0,0,0,0,0,0,0,0,0,0,0,0,0,0,0,0,0,0,0,0,0,0,0,0,0,0,0,0,0,0,0,0,0,0,0,0,0,0,0,0,0,0,0,0,0,0,0,0,0,0,0,0,0,0,0,0,0,0,0,0,0,0,{"$f":"EC436","v":0},0,0,0,0,0,0,0,0,0,0,0,0,0,0,0,0,0,0,0,0,0,0,0,0,0,0,0,0,0,0,0,0,0,0,0,0,0,0,0,0,0,0,0,0,0,0,0,0,0,0,0,0,0,0,0,0,0,0,0,0,0,0,0,{"$f":"GO436","v":0},0,0,0,0,0,0,0,0,0,0,0,0,0,0,0,0,0,0,0,0,0,0,0,0,0,0,0,0,0,0,0,0,0,0,0,0,0,0,0,0,0,0,0,0,0,0,0,0,0,0,0,0,0,0,0,0,0,0,0,0,0,0,0,{"$f":"JA436","v":0},0,0,0,0,0,0,0,0,0,0,0,0,0,0,0,0,0,0,0,0,0,0,0,0,0,0,0,0,0,0,0,0,0,0,0,0,0,0,0,0,0,0,0,0,0,0,0,0,0,0,0,0,0,0,0,0,0,0,0,0,0,0,0,{"$f":"LM436","v":0},0,0,0,0,0,0,0,0,0,0,0,0,0,0,0,0,0,0,0,0,0,0,0,0,0,0,0,0,0,0,0,0,0,0,0,0,0,0,0,0,0,0,0,0,0,0,0,0,0,0,0,0,0,0,0,0,0,0,0,0,0,0,0,{"$f":"NY436","v":0},0,0,0,0,0,0,0,0,0,0,0,0,0,0,0,0,0,0,0,0,0,0,0,0,0,0,0,0,0,0,0,0,0,0,0,0,0,0,0,0,0,0,0,0,0,0,0,0,0,0,0,0,0,0,0,0,0,0,0,0,0,0,0,{"$f":"QK436","v":0},0,0,0,0,0,0,0,0,0,0,0,0,0,0,0,0,0,0,0,0,0,0,0,0,0,0,0,0,0,0,0,0,0,0,0,0,0,0,0,0,0,0,0,0,0,0,0,0,0,0,0,0,0,0,0,0,0,0,0,0,0,0,0,{"$f":"SW436","v":0},0,0,0,0,0,0,0,0,0,0,0,0,0,0,0,0,0,0,0,0,0,0,0,0,0,0,0,0,0,0,0,0,0,0,0,0,0,0,0,0,0,0,0,0,0,0,0,0,0,0,0,0,0,0,0,0,0,0,0,0,0,0,0,{"$f":"VI436","v":0},0,0,0,0,0,0,0,0,0,0,0,0,0,0,0,0,0,0,0,0,0,0,0,0,0,0,0,0,0,0,0,0,0,0,0,0,0,0,0,0,0,0,0,0,0,0,0,0,0,0,0,0,0,0,0,0,0,0,0,0,0,0,0,{"$f":"XU436","v":0},0,0,0,0,0,0,0,0,0,0,0,0,0,0,0,0,0,0,0,0,0,0,0,0,0,0,0,0,0,0,0,0,0,0,0,0,0,0,0,0,0,0,0,0,0,0,0,0,0,0,0,0,0,0,0,0,0,0,0,0,0,0,0,{"$f":"AAG436","v":0},0,0,0,0,0,0,0,0,0,0,0,0,0,0,0,0,0,0,0,0,0,0,0,0,0,0,0,0,0,0,0,0,0,0,0,0,0,0,0,0,0,0,0,0,0,0,0,0,0,0,0,0,0,0,0,0,0,0,0,0,0,0,0,{"$f":"ACS436","v":0},0,0,0,0,0,0,0,0,0,0,0,0,0,0,0,0,0,0,0,0,0,0,0,0,0,0,0,0,0,0,0,0,0,0,0,0,0,0,0,0,0,0,0,0,0,0,0,0,0,0,0,0,0,0,0,0,0,0,0,0,0,0,0,{"$f":"AFE436","v":0},0,0,0,0,0,0,0,0,0,0,0,0,0,0,0,0,0,0,0,0,0,0,0,0,0,0,0,0,0,0,0,0,0,0,0,0,0,0,0,0,0,0,0,0,0,0,0,0,0,0,0,0,0,0,0,0,0,0,0,0,0,0,0,{"$f":"AHQ436","v":0},0,0,0,0,0,0,0,0,0,0,0,0,0,0,0,0,0,0,0,0,0,0,0,0,0,0,0,0,0,0,0,0,0,0,0,0,0,0,0,0,0,0,0,0,0,0,0,0,0,0,0,0,0,0,0,0,0,0,0,0,0,0,0,{"$f":"AKC436","v":0},0,0,0,0,0,0,0,0,0,0,0,0,0,0,0,0,0,0,0,0,0,0,0,0,0,0,0,0,0,0,0,0,0,0,0,0,0,0,0,0,0,0,0,0,0,0,0,0,0,0,0,0,0,0,0,0,0,0,0,0,0,0,0,{"$f":"AMO436","v":0},0,0,0,0,0,0,0,0,0,0,0,0,0,0,0,0,0,0,0,0,0,0,0,0,0,0,0,0,0,0,0,0,0,0,0,0,0,0,0,0,0,0,0,0,0,0,0,0,0,0,0,0,0,0,0,0,0,0,0,0,0,0,0,{"$f":"APA436","v":0},0,0,0,0,0,0,0,0,0,0,0,0,0,0,0,0,0,0,0,0,0,0,0,0,0,0,0,0,0,0,0,0,0,0,0,0,0,0,0,0,0,0,0,0,0,0,0,0,0,0,0,0,0,0,0,0,0,0,0,0,0,0,0,{"$f":"ARM436","v":0},0,0,0,0,0,0,0,0,0,0,0,0,0,0,0,0,0,0,0,0,0,0,0,0,0,0,0,0,0,0,0,0,0,0,0,0,0,0,0,0,0,0,0,0,0,0,0,0,0,0,0,0,0,0,0,0,0,0,0,0,0,0,0,{"$f":"ATY436","v":0},0,0,0,0,0,0,0,0,0,0,0,0,0,0,0,0,0,0,0,0,0,0,0,0,0,0,0,0,0,0,0,0,0,0,0,0,0,0,0,0,0,0,0,0,0,0,0,0,0,0,0,0,0,0,0,0,0,0,0,0,0,0,0,{"$f":"AWK436","v":0},0,0,0,0,0,0,0,0,0,0,0,0,0,0,0,0,0,0,0,0,0,0,0,0,0,0,0,0,0,0,0,0,0,0,0,0,0,0,0,0,0,0,0,0,0,0,0,0,0,0,0,0,0,0,0,0,0,0,0,0,0,0,0,{"$f":"AYW436","v":0},0,0,0,0,0,0,0,0,0,0,0,0,0,0,0,0,0,0,0,0,0,0,0,0,0,0,0,0,0,0,0,0,0,0,0,0,0,0,0,0,0,0,0,0,0,0,0,0,0,0,0,0,0,0,0,0,0,0,0,0,0,0,0,{"$f":"BBI436","v":0},0,0,0,0,0,0,0,0,0,0,0,0,0,0,0,0,0,0,0,0,0,0,0,0,0,0,0,0,0,0,0,0,0,0,0,0,0,0,0,0,0,0,0,0,0,0,0,0,0,0,0,0,0,0,0,0,0,0,0,0,0,0,0,{"$f":"BDU436","v":0},0,0,0,0,0,0,0,0,0,0,0,0,0,0,0,0,0,0,0,0,0,0,0,0,0,0,0,0,0,0,0,0,0,0,0,0,0,0,0,0,0,0,0,0,0,0,0,0,0,0,0,0,0,0,0,0,0,0,0,0,0,0,0,{"$f":"BGG436","v":0},0,0,0,0,0,0,0,0,0,0,0,0,0,0,0,0,0,0,0,0,0,0,0,0,0,0,0,0,0,0,0,0,0,0,0,0,0,0,0,0,0,0,0,0,0,0,0,0,0,0,0,0,0,0,0,0,0,0,0,0,0,0,0,{"$f":"BIS436","v":0},0,0,0,0,0,0,0,0,0,0,0,0,0,0,0,0,0,0,0,0,0,0,0,0,0,0,0,0,0,0,0,0,0,0,0,0,0,0,0,0,0,0,0,0,0,0,0,0,0,0,0,0,0,0,0,0,0,0,0,0,0,0,0,{"$f":"BLE436","v":0},0,0,0,0,0,0,0,0,0,0,0,0,0,0,0,0,0,0,0,0,0,0,0,0,0,0,0,0,0,0,0,0,0,0,0,0,0,0,0,0,0,0,0,0,0,0,0,0,0,0,0,0,0,0,0,0,0,0,0,0,0,0,0,{"$f":"BNQ436","v":0},0,0,0,0,0,0,0,0,0,0,0,0,0,0,0,0,0,0,0,0,0,0,0,0,0,0,0,0,0,0,0,0,0,0,0,0,0,0,0,0,0,0,0,0,0,0,0,0,0,0,0,0,0,0,0,0,0,0,0,0,0,0,0,{"$f":"BQC436","v":0},0,0,0,0,0,0,0,0,0,0,0,0,0,0,0,0,0,0,0,0,0,0,0,0,0,0,0,0,0,0,0,0,0,0,0,0,0,0,0,0,0,0,0,0,0,0,0,0,0,0,0,0,0,0,0,0,0,0,0,0,0,0,0,{"$f":"BSO436","v":0},0,0,0,0,0,0,0,0,0,0,0,0,0,0,0,0,0,0,0,0,0,0,0,0,0,0,0,0,0,0,0,0,0,0,0,0,0,0,0,0,0,0,0,0,0,0,0,0,0,0,0,0,0,0,0,0,0,0,0,0,0,0,0,{"$f":"BVA436","v":0},0,0,0,0,0,0,0,0,0,0,0,0,0,0,0,0,0,0,0,0,0,0,0,0,0,0,0,0,0,0,0,0,0,0,0,0,0,0,0,0,0,0,0,0,0,0,0,0,0,0,0,0,0,0,0,0,0,0,0,0,0,0,0,{"$f":"BXM436","v":0},0,0,0,0,0,0,0,0,0,0,0,0,0,0,0,0,0,0,0,0,0,0,0,0,0,0,0,0,0,0,0,0,0,0,0,0,0,0,0,0,0,0,0,0,0,0,0,0,0,0,0,0,0,0,0,0,0,0,0,0,0,0,0,{"$f":"BZY436","v":0},0,0,0,0,0,0,0,0,0,0,0,0,0,0,0,0,0,0,0,0,0,0,0,0,0,0,0,0,0,0,0,0,0,0,0,0,0,0,0,0,0,0,0,0,0,0,0,0,0,0,0,0,0,0,0,0,0,0,0,0,0,0,0,{"$f":"CCK436","v":0},0,0,0,0,0,0,0,0,0,0,0,0,0,0,0,0,0,0,0,0,0,0,0,0,0,0,0,0,0,0,0,0,0,0,0,0,0,0,0,0,0,0,0,0,0,0,0,0,0,0,0,0,0,0,0,0,0,0,0,0,0,0,0,{"$f":"CEW436","v":0},0,0,0,0,0,0,0,0,0,0,0,0,0,0,0,0,0,0,0,0,0,0,0,0,0,0,0,0,0,0,0,0,0,0,0,0,0,0,0,0,0,0,0,0,0,0,0,0,0,0,0,0,0,0,0,0,0,0,0,0,0,0,0,{"$f":"CHI436","v":0},0,0,0,0,0,0,0,0,0,0,0,0,0,0,0,0,0,0,0,0,0,0,0,0,0,0,0,0,0,0,0,0,0,0,0,0,0,0,0,0,0,0,0,0,0,0,0,0,0,0,0,0,0,0,0,0,0,0,0,0,0,0,0,{"$f":"CJU436","v":0},0,0,0,0,0,0,0,0,0,0,0,0,0,0,0,0,0,0,0,0,0,0,0,0,0,0,0,0,0,0,0,0,0,0,0,0,0,0,0,0,0,0,0,0,0,0,0,0,0,0,0,0,0,0,0,0,0,0,0,0,0,0,0,{"$f":"CMG436","v":0},0,0,0,0,0,0,0,0,0,0,0,0,0,0,0,0,0,0,0,0,0,0,0,0,0,0,0,0,0,0,0,0,0,0,0,0,0,0,0,0,0,0,0,0,0,0,0,0,0,0,0,0,0,0,0,0,0,0,0,0,0,0,0,{"$f":"COS436","v":0},0,0,0,0,0,0,0,0,0,0,0,0,0,0,0,0,0,0,0,0,0,0,0,0,0,0,0,0,0,0,0,0,0,0,0,0,0,0,0,0,0,0,0,0,0,0,0,0,0,0,0,0,0,0,0,0,0,0,0,0,0,0,0,{"$f":"CRE436","v":0},0,0,0,0,0,0,0,0,0,0,0,0,0,0,0,0,0,0,0,0,0,0,0,0,0,0,0,0,0,0,0,0,0,0,0,0,0,0,0,0,0,0,0,0,0,0,0,0,0,0,0,0,0,0,0,0,0,0,0,0,0,0,0,{"$f":"CTQ436","v":0},0,0,0,0,0,0,0,0,0,0,0,0,0,0,0,0,0,0,0,0,0,0,0,0,0,0,0,0,0,0,0,0,0,0,0,0,0,0,0,0,0,0,0,0,0,0,0,0,0,0,0,0,0,0,0,0,0,0,0,0,0,0,0,{"$f":"CWC436","v":0},0,0,0,0,0,0,0,0,0,0,0,0,0,0,0,0,0,0,0,0,0,0,0,0,0,0,0,0,0,0,0,0,0,0,0,0,0,0,0,0,0,0,0,0,0,0,0,0,0,0,0,0,0,0,0,0,0,0,0,0,0,0,0,{"$f":"CYO436","v":0},0,0,0,0,0,0,0,0,0,0,0,0,0,0,0,0,0,0,0,0,0,0,0,0,0,0,0,0,0,0,0,0,0,0,0,0,0,0,0,0,0,0,0,0,0,0,0,0,0,0,0,0,0,0,0,0,0,0,0,0,0,0,0,{"$f":"DBA436","v":0},0,0,0,0,0,0,0,0,0,0,0,0,0,0,0,0,0,0,0,0,0,0,0,0,0,0,0,0,0,0,0,0,0,0,0,0,0,0,0,0,0,0,0,0,0,0,0,0,0,0,0,0,0,0,0,0,0,0,0,0,0,0,0,{"$f":"DDM436","v":0},0,0,0,0,0,0,0,0,0,0,0,0,0,0,0,0,0,0,0,0,0,0,0,0,0,0,0,0,0,0,0,0,0,0,0,0,0,0,0,0,0,0,0,0,0,0,0,0,0,0,0,0,0,0,0,0,0,0,0,0,0,0,0,{"$f":"DFY436","v":0},0,0,0,0,0,0,0,0,0,0,0,0,0,0,0,0,0,0,0,0,0,0,0,0,0,0,0,0,0,0,0,0,0,0,0,0,0,0,0,0,0,0,0,0,0,0,0,0,0,0,0,0,0,0,0,0,0,0,0,0,0,0,0,{"$f":"DIK436","v":0},0,0,0,0,0,0,0,0,0,0,0,0,0,0,0,0,0,0,0,0,0,0,0,0,0,0,0,0,0,0,0,0,0,0,0,0,0,0,0,0,0,0,0,0,0,0,0,0,0,0,0,0,0,0,0,0,0,0,0,0,0,0,0,{"$f":"DKW436","v":0},0,0,0,0,0,0,0,0,0,0,0,0,0,0,0,0,0,0,0,0,0,0,0,0,0,0,0,0,0,0,0,0,0,0,0,0,0,0,0,0,0,0,0,0,0,0,0,0,0,0,0,0,0,0,0,0,0,0,0,0,0,0,0,{"$f":"DNI436","v":0},0,0,0,0,0,0,0,0,0,0,0,0,0,0,0,0,0,0,0,0,0,0,0,0,0,0,0,0,0,0,0,0,0,0,0,0,0,0,0,0,0,0,0,0,0,0,0,0,0,0,0,0,0,0,0,0,0,0,0,0,0,0,0,{"$f":"DPU436","v":0},0,0,0,0,0,0,0,0,0,0,0,0,0,0,0,0,0,0,0,0,0,0,0,0,0,0,0,0,0,0,0,0,0,0,0,0,0,0,0,0,0,0,0,0,0,0,0,0,0,0,0,0,0,0,0,0,0,0,0,0,0,0,0,{"$f":"DSG436","v":0},0,0,0,0,0,0,0,0,0,0,0,0,0,0,0,0,0,0,0,0,0,0,0,0,0,0,0,0,0,0,0,0,0,0,0,0,0,0,0,0,0,0,0,0,0,0,0,0,0,0,0,0,0,0,0,0,0,0,0,0,0,0,0,{"$f":"DUS436","v":0},0,0,0,0,0,0,0,0,0,0,0,0,0,0,0,0,0,0,0,0,0,0,0,0,0,0,0,0,0,0,0,0,0,0,0,0,0,0,0,0,0,0,0,0,0,0,0,0,0,0,0,0,0,0,0,0,0,0,0,0,0,0,0,{"$f":"DXE436","v":0},0,0,0,0,0,0,0,0,0,0,0,0,0,0,0,0,0,0,0,0,0,0,0,0,0,0,0,0,0,0,0,0,0,0,0,0,0,0,0,0,0,0,0,0,0,0,0,0,0,0,0,0,0,0,0,0,0,0,0,0,0,0,0,{"$f":"DZQ436","v":0},0,0,0,0,0,0,0,0,0,0,0,0,0,0,0,0,0,0,0,0,0,0,0,0,0,0,0,0,0,0,0,0,0,0,0,0,0,0,0,0,0,0,0,0,0,0,0,0,0,0,0,0,0,0,0,0,0,0,0,0,0,0,0,{"$f":"ECC436","v":0},0,0,0,0,0,0,0,0,0,0,0,0,0,0,0,0,0,0,0,0,0,0,0,0,0,0,0,0,0,0,0,0,0,0,0,0,0,0,0,0,0,0,0,0,0,0,0,0,0,0,0,0,0,0,0,0,0,0,0,0,0,0,0,{"$f":"EEO436","v":0},0,0,0,0,0,0,0,0,0,0,0,0,0,0,0,0,0,0,0,0,0,0,0,0,0,0,0,0,0,0,0,0,0,0,0,0,0,0,0,0,0,0,0,0,0,0,0,0,0,0,0,0,0,0,0,0,0,0,0,0,0,0,0,{"$f":"EHA436","v":0},0,0,0,0,0,0,0,0,0,0,0,0,0,0,0,0,0,0,0,0,0,0,0,0,0,0,0,0,0,0,0,0,0,0,0,0,0,0,0,0,0,0,0,0,0,0,0,0,0,0,0,0,0,0,0,0,0,0,0,0,0,0,0,{"$f":"EJM436","v":0},0,0,0,0,0,0,0,0,0,0,0,0,0,0,0,0,0,0,0,0,0,0,0,0,0,0,0,0,0,0,0,0,0,0,0,0,0,0,0,0,0,0,0,0,0,0,0,0,0,0,0,0,0,0,0,0,0,0,0,0,0,0,0,{"$f":"ELY436","v":0},0,0,0,0,0,0,0,0,0,0,0,0,0,0,0,0,0,0,0,0,0,0,0,0,0,0,0,0,0,0,0,0,0,0,0,0,0,0,0,0,0,0,0,0,0,0,0,0,0,0,0,0,0,0,0,0,0,0,0,0,0,0,0,{"$f":"EOK436","v":0},0,0,0,0,0,0,0,0,0,0,0,0,0,0,0,0,0,0,0,0,0,0,0,0,0,0,0,0,0,0,0,0,0,0,0,0,0,0,0,0,0,0,0,0,0,0,0,0,0,0,0,0,0,0,0,0,0,0,0,0,0,0,0,{"$f":"EQW436","v":0},0,0,0,0,0,0,0,0,0,0,0,0,0,0,0,0,0,0,0,0,0,0,0,0,0,0,0,0,0,0,0,0,0,0,0,0,0,0,0,0,0,0,0,0,0,0,0,0,0,0,0,0,0,0,0,0,0,0,0,0,0,0,0,{"$f":"ETI436","v":0},0,0,0,0,0,0,0,0,0,0,0,0,0,0,0,0,0,0,0,0,0,0,0,0,0,0,0,0,0,0,0,0,0,0,0,0,0,0,0,0,0,0,0,0,0,0,0,0,0,0,0,0,0,0,0,0,0,0,0,0,0,0,0,{"$f":"EVU436","v":0},0,0,0,0,0,0,0,0,0,0,0,0,0,0,0,0,0,0,0,0,0,0,0,0,0,0,0,0,0,0,0,0,0,0,0,0,0,0,0,0,0,0,0,0,0,0,0,0,0,0,0,0,0,0,0,0,0,0,0,0,0,0,0,{"$f":"EYG436","v":0},0,0,0,0,0,0,0,0,0,0,0,0,0,0,0,0,0,0,0,0,0,0,0,0,0,0,0,0,0,0,0,0,0,0,0,0,0,0,0,0,0,0,0,0,0,0,0,0,0,0,0,0,0,0,0,0,0,0,0,0,0,0,0,{"$f":"FAS436","v":0},0,0,0,0,0,0,0,0,0,0,0,0,0,0,0,0,0,0,0,0,0,0,0,0,0,0,0,0,0,0,0,0,0,0,0,0,0,0,0,0,0,0,0,0,0,0,0,0,0,0,0,0,0,0,0,0,0,0,0,0,0,0,0,{"$f":"FDE436","v":0},0,0,0,0,0,0,0,0,0,0,0,0,0,0,0,0,0,0,0,0,0,0,0,0,0,0,0,0,0,0,0,0,0,0,0,0,0,0,0,0,0,0,0,0,0,0,0,0,0,0,0,0,0,0,0,0,0,0,0,0,0,0,0,{"$f":"FFQ436","v":0},0,0,0,0,0,0,0,0,0,0,0,0,0,0,0,0,0,0,0,0,0,0,0,0,0,0,0,0,0,0,0,0,0,0,0,0,0,0,0,0,0,0,0,0,0,0,0,0,0,0,0,0,0,0,0,0,0,0,0,0,0,0,0,{"$f":"FIC436","v":0},0,0,0,0,0,0,0,0,0,0,0,0,0,0,0,0,0,0,0,0,0,0,0,0,0,0,0,0,0,0,0,0,0,0,0,0,0,0,0,0,0,0,0,0,0,0,0,0,0,0,0,0,0,0,0,0,0,0,0,0,0,0,0,{"$f":"FKO436","v":0},0,0,0,0,0,0,0,0,0,0,0,0,0,0,0,0,0,0,0,0,0,0,0,0,0,0,0,0,0,0,0,0,0,0,0,0,0,0,0,0,0,0,0,0,0,0,0,0,0,0,0,0,0,0,0,0,0,0,0,0,0,0,0,{"$f":"FNA436","v":0},0,0,0,0,0,0,0,0,0,0,0,0,0,0,0,0,0,0,0,0,0,0,0,0,0,0,0,0,0,0,0,0,0,0,0,0,0,0,0,0,0,0,0,0,0,0,0,0,0,0,0,0,0,0,0,0,0,0,0,0,0,0,0,{"$f":"FPM436","v":0},0,0,0,0,0,0,0,0,0,0,0,0,0,0,0,0,0,0,0,0,0,0,0,0,0,0,0,0,0,0,0,0,0,0,0,0,0,0,0,0,0,0,0,0,0,0,0,0,0,0,0,0,0,0,0,0,0,0,0,0,0,0,0,{"$f":"FRY436","v":0},0,0,0,0,0,0,0,0,0,0,0,0,0,0,0,0,0,0,0,0,0,0,0,0,0,0,0,0,0,0,0,0,0,0,0,0,0,0,0,0,0,0,0,0,0,0,0,0,0,0,0,0,0,0,0,0,0,0,0,0,0,0,0,{"$f":"FUK436","v":0},0,0,0,0,0,0,0,0,0,0,0,0,0,0,0,0,0,0,0,0,0,0,0,0,0,0,0,0,0,0,0,0,0,0,0,0,0,0,0,0,0,0,0,0,0,0,0,0,0,0,0,0,0,0,0,0,0,0,0,0,0,0,0,{"$f":"FWW436","v":0},0,0,0,0,0,0,0,0,0,0,0,0,0,0,0,0,0,0,0,0,0,0,0,0,0,0,0,0,0,0,0,0,0,0,0,0,0,0,0,0,0,0,0,0,0,0,0,0,0,0,0,0,0,0,0,0,0,0,0,0,0,0,0,{"$f":"FZI436","v":0},0,0,0,0,0,0,0,0,0,0,0,0,0,0,0,0,0,0,0,0,0,0,0,0,0,0,0,0,0,0,0,0,0,0,0,0,0,0,0,0,0,0,0,0,0,0,0,0,0,0,0,0,0,0,0,0,0,0,0,0,0,0,0,{"$f":"GBU436","v":0},0,0,0,0,0,0,0,0,0,0,0,0,0,0,0,0,0,0,0,0,0,0,0,0,0,0,0,0,0,0,0,0,0,0,0,0,0,0,0,0,0,0,0,0,0,0,0,0,0,0,0,0,0,0,0,0,0,0,0,0,0,0,0,{"$f":"GEG436","v":0},0,0,0,0,0,0,0,0,0,0,0,0,0,0,0,0,0,0,0,0,0,0,0,0,0,0,0,0,0,0,0,0,0,0,0,0,0,0,0,0,0,0,0,0,0,0,0,0,0,0,0,0,0,0,0,0,0,0,0,0,0,0,0,{"$f":"GGS436","v":0},0,0,0,0,0,0,0,0,0,0,0,0,0,0,0,0,0,0,0,0,0,0,0,0,0,0,0,0,0,0,0,0,0,0,0,0,0,0,0,0,0,0,0,0,0,0,0,0,0,0,0,0,0,0,0,0,0,0,0,0,0,0,0,{"$f":"GJE436","v":0},0,0,0,0,0,0,0,0,0,0,0,0,0,0,0,0,0,0,0,0,0,0,0,0,0,0,0,0,0,0,0,0,0,0,0,0,0,0,0,0,0,0,0,0,0,0,0,0,0,0,0,0,0,0,0,0,0,0,0,0,0,0,0,{"$f":"GLQ436","v":0},0,0,0,0,0,0,0,0,0,0,0,0,0,0,0,0,0,0,0,0,0,0,0,0,0,0,0,0,0,0,0,0,0,0,0,0,0,0,0,0,0,0,0,0,0,0,0,0,0,0,0,0,0,0,0,0,0,0,0,0,0,0,0,{"$f":"GOC436","v":0},0,0,0,0,0,0,0,0,0,0,0,0,0,0,0,0,0,0,0,0,0,0,0,0,0,0,0,0,0,0,0,0,0,0,0,0,0,0,0,0,0,0,0,0,0,0,0,0,0,0,0,0,0,0,0,0,0,0,0,0,0,0,0,{"$f":"GQO436","v":0},0,0,0,0,0,0,0,0,0,0,0,0,0,0,0,0,0,0,0,0,0,0,0,0,0,0,0,0,0,0,0,0,0,0,0,0,0,0,0,0,0,0,0,0,0,0,0,0,0,0,0,0,0,0,0,0,0,0,0,0,0,0,0,{"$f":"GTA436","v":0},0,0,0,0,0,0,0,0,0,0,0,0,0,0,0,0,0,0,0,0,0,0,0,0,0,0,0,0,0,0,0,0,0,0,0,0,0,0,0,0,0,0,0,0,0,0,0,0,0,0,0,0,0,0,0,0,0,0,0,0,0,0,0,{"$f":"GVM436","v":0},0,0,0,0,0,0,0,0,0,0,0,0,0,0,0,0,0,0,0,0,0,0,0,0,0,0,0,0,0,0,0,0,0,0,0,0,0,0,0,0,0,0,0,0,0,0,0,0,0,0,0,0,0,0,0,0,0,0,0,0,0,0,0,{"$f":"GXY436","v":0},0,0,0,0,0,0,0,0,0,0,0,0,0,0,0,0,0,0,0,0,0,0,0,0,0,0,0,0,0,0,0,0,0,0,0,0,0,0,0,0,0,0,0,0,0,0,0,0,0,0,0,0,0,0,0,0,0,0,0,0,0,0,0,{"$f":"HAK436","v":0},0,0,0,0,0,0,0,0,0,0,0,0,0,0,0,0,0,0,0,0,0,0,0,0,0,0,0,0,0,0,0,0,0,0,0,0,0,0,0,0,0,0,0,0,0,0,0,0,0,0,0,0,0,0,0,0,0,0,0,0,0,0,0,{"$f":"HCW436","v":0},0,0,0,0,0,0,0,0,0,0,0,0,0,0,0,0,0,0,0,0,0,0,0,0,0,0,0,0,0,0,0,0,0,0,0,0,0,0,0,0,0,0,0,0,0,0,0,0,0,0,0,0,0,0,0,0,0,0,0,0,0,0,0,{"$f":"HFI436","v":0},0,0,0,0,0,0,0,0,0,0,0,0,0,0,0,0,0,0,0,0,0,0,0,0,0,0,0,0,0,0,0,0,0,0,0,0,0,0,0,0,0,0,0,0,0,0,0,0,0,0,0,0,0,0,0,0,0,0,0,0,0,0,0,{"$f":"HHU436","v":0},0,0,0,0,0,0,0,0,0,0,0,0,0,0,0,0,0,0,0,0,0,0,0,0,0,0,0,0,0,0,0,0,0,0,0,0,0,0,0,0,0,0,0,0,0,0,0,0,0,0,0,0,0,0,0,0,0,0,0,0,0,0,0,{"$f":"HKG436","v":0},0,0,0,0,0,0,0,0,0,0,0,0,0,0,0,0,0,0,0,0,0,0,0,0,0,0,0,0,0,0,0,0,0,0,0,0,0,0,0,0,0,0,0,0,0,0,0,0,0,0,0,0,0,0,0,0,0,0,0,0,0,0,0,{"$f":"HMS436","v":0},0,0,0,0,0,0,0,0,0,0,0,0,0,0,0,0,0,0,0,0,0,0,0,0,0,0,0,0,0,0,0,0,0,0,0,0,0,0,0,0,0,0,0,0,0,0,0,0,0,0,0,0,0,0,0,0,0,0,0,0,0,0,0,{"$f":"HPE436","v":0},0,0,0,0,0,0,0,0,0,0,0,0,0,0,0,0,0,0,0,0,0,0,0,0,0,0,0,0,0,0,0,0,0,0,0,0,0,0,0,0,0,0,0,0,0,0,0,0,0,0,0,0,0,0,0,0,0,0,0,0,0,0,0,{"$f":"HRQ436","v":0},0,0,0,0,0,0,0,0,0,0,0,0,0,0,0,0,0,0,0,0,0,0,0,0,0,0,0,0,0,0,0,0,0,0,0,0,0,0,0,0,0,0,0,0,0,0,0,0,0,0,0,0,0,0,0,0,0,0,0,0,0,0,0,{"$f":"HUC436","v":0},0,0,0,0,0,0,0,0,0,0,0,0,0,0,0,0,0,0,0,0,0,0,0,0,0,0,0,0,0,0,0,0,0,0,0,0,0,0,0,0,0,0,0,0,0,0,0,0,0,0,0,0,0,0,0,0,0,0,0,0,0,0,0,{"$f":"HWO436","v":0},0,0,0,0,0,0,0,0,0,0,0,0,0,0,0,0,0,0,0,0,0,0,0,0,0,0,0,0,0,0,0,0,0,0,0,0,0,0,0,0,0,0,0,0,0,0,0,0,0,0,0,0,0,0,0,0,0,0,0,0,0,0,0,{"$f":"HZA436","v":0},0,0,0,0,0,0,0,0,0,0,0,0,0,0,0,0,0,0,0,0,0,0,0,0,0,0,0,0,0,0,0,0,0,0,0,0,0,0,0,0,0,0,0,0,0,0,0,0,0,0,0,0,0,0,0,0,0,0,0,0,0,0,0,{"$f":"IBM436","v":0},0,0,0,0,0,0,0,0,0,0,0,0,0,0,0,0,0,0,0,0,0,0,0,0,0,0,0,0,0,0,0,0,0,0,0,0,0,0,0,0,0,0,0,0,0,0,0,0,0,0,0,0,0,0,0,0,0,0,0,0,0,0,0,{"$f":"IDY436","v":0},0,0,0,0,0,0,0,0,0,0,0,0,0,0,0,0,0,0,0,0,0,0,0,0,0,0,0,0,0,0,0,0,0,0,0,0,0,0,0,0,0,0,0,0,0,0,0,0,0,0,0,0,0,0,0,0,0,0,0,0,0,0,0,{"$f":"IGK436","v":0},0,0,0,0,0,0,0,0,0,0,0,0,0,0,0,0,0,0,0,0,0,0,0,0,0,0,0,0,0,0,0,0,0,0,0,0,0,0,0,0,0,0,0,0,0,0,0,0,0,0,0,0,0,0,0,0,0,0,0,0,0,0,0,{"$f":"IIW436","v":0},0,0,0,0,0,0,0,0,0,0,0,0,0,0,0,0,0,0,0,0,0,0,0,0,0,0,0,0,0,0,0,0,0,0,0,0,0,0,0,0,0,0,0,0,0,0,0,0,0,0,0,0,0,0,0,0,0,0,0,0,0,0,0,{"$f":"ILI436","v":0},0,0,0,0,0,0,0,0,0,0,0,0,0,0,0,0,0,0,0,0,0,0,0,0,0,0,0,0,0,0,0,0,0,0,0,0,0,0,0,0,0,0,0,0,0,0,0,0,0,0,0,0,0,0,0,0,0,0,0,0,0,0,0,{"$f":"INU436","v":0},0,0,0,0,0,0,0,0,0,0,0,0,0,0,0,0,0,0,0,0,0,0,0,0,0,0,0,0,0,0,0,0,0,0,0,0,0,0,0,0,0,0,0,0,0,0,0,0,0,0,0,0,0,0,0,0,0,0,0,0,0,0,0,{"$f":"IQG436","v":0},0,0,0,0,0,0,0,0,0,0,0,0,0,0,0,0,0,0,0,0,0,0,0,0,0,0,0,0,0,0,0,0,0,0,0,0,0,0,0,0,0,0,0,0,0,0,0,0,0,0,0,0,0,0,0,0,0,0,0,0,0,0,0,{"$f":"ISS436","v":0},0,0,0,0,0,0,0,0,0,0,0,0,0,0,0,0,0,0,0,0,0,0,0,0,0,0,0,0,0,0,0,0,0,0,0,0,0,0,0,0,0,0,0,0,0,0,0,0,0,0,0,0,0,0,0,0,0,0,0,0,0,0,0,{"$f":"IVE436","v":0},0,0,0,0,0,0,0,0,0,0,0,0,0,0,0,0,0,0,0,0,0,0,0,0,0,0,0,0,0,0,0,0,0,0,0,0,0,0,0,0,0,0,0,0,0,0,0,0,0,0,0,0,0,0,0,0,0,0,0,0,0,0,0,{"$f":"IXQ436","v":0},0,0,0,0,0,0,0,0,0,0,0,0,0,0,0,0,0,0,0,0,0,0,0,0,0,0,0,0,0,0,0,0,0,0,0,0,0,0,0,0,0,0,0,0,0,0,0,0,0,0,0,0,0,0,0,0,0,0,0,0,0,0,0,{"$f":"JAC436","v":0},0,0,0,0,0,0,0,0,0,0,0,0,0,0,0,0,0,0,0,0,0,0,0,0,0,0,0,0,0,0,0,0,0,0,0,0,0,0,0,0,0,0,0,0,0,0,0,0,0,0,0,0,0,0,0,0,0,0,0,0,0,0,0,{"$f":"JCO436","v":0},0,0,0,0,0,0,0,0,0,0,0,0,0,0,0,0,0,0,0,0,0,0,0,0,0,0,0,0,0,0,0,0,0,0,0,0,0,0,0,0,0,0,0,0,0,0,0,0,0,0,0,0,0,0,0,0,0,0,0,0,0,0,0,{"$f":"JFA436","v":0},0,0,0,0,0,0,0,0,0,0,0,0,0,0,0,0,0,0,0,0,0,0,0,0,0,0,0,0,0,0,0,0,0,0,0,0,0,0,0,0,0,0,0,0,0,0,0,0,0,0,0,0,0,0,0,0,0,0,0,0,0,0,0,{"$f":"JHM436","v":0},0,0,0,0,0,0,0,0,0,0,0,0,0,0,0,0,0,0,0,0,0,0,0,0,0,0,0,0,0,0,0,0,0,0,0,0,0,0,0,0,0,0,0,0,0,0,0,0,0,0,0,0,0,0,0,0,0,0,0,0,0,0,0,{"$f":"JJY436","v":0},0,0,0,0,0,0,0,0,0,0,0,0,0,0,0,0,0,0,0,0,0,0,0,0,0,0,0,0,0,0,0,0,0,0,0,0,0,0,0,0,0,0,0,0,0,0,0,0,0,0,0,0,0,0,0,0,0,0,0,0,0,0,0,{"$f":"JMK436","v":0},0,0,0,0,0,0,0,0,0,0,0,0,0,0,0,0,0,0,0,0,0,0,0,0,0,0,0,0,0,0,0,0,0,0,0,0,0,0,0,0,0,0,0,0,0,0,0,0,0,0,0,0,0,0,0,0,0,0,0,0,0,0,0,{"$f":"JOW436","v":0},0,0,0,0,0,0,0,0,0,0,0,0,0,0,0,0,0,0,0,0,0,0,0,0,0,0,0,0,0,0,0,0,0,0,0,0,0,0,0,0,0,0,0,0,0,0,0,0,0,0,0,0,0,0,0,0,0,0,0,0,0,0,0,{"$f":"JRI436","v":0},0,0,0,0,0,0,0,0,0,0,0,0,0,0,0,0,0,0,0,0,0,0,0,0,0,0,0,0,0,0,0,0,0,0,0,0,0,0,0,0,0,0,0,0,0,0,0,0,0,0,0,0,0,0,0,0,0,0,0,0,0,0,0,{"$f":"JTU436","v":0},0,0,0,0,0,0,0,0,0,0,0,0,0,0,0,0,0,0,0,0,0,0,0,0,0,0,0,0,0,0,0,0,0,0,0,0,0,0,0,0,0,0,0,0,0,0,0,0,0,0,0,0,0,0,0,0,0,0,0,0,0,0,0,{"$f":"JWG436","v":0},0,0,0,0,0,0,0,0,0,0,0,0,0,0,0,0,0,0,0,0,0,0,0,0,0,0,0,0,0,0,0,0,0,0,0,0,0,0,0,0,0,0,0,0,0,0,0,0,0,0,0,0,0,0,0,0,0,0,0,0,0,0,0,{"$f":"JYS436","v":0},0,0,0,0,0,0,0,0,0,0,0,0,0,0,0,0,0,0,0,0,0,0,0,0,0,0,0,0,0,0,0,0,0,0,0,0,0,0,0,0,0,0,0,0,0,0,0,0,0,0,0,0,0,0,0,0,0,0,0,0,0,0,0,{"$f":"KBE436","v":0},0,0,0,0,0,0,0,0,0,0,0,0,0,0,0,0,0,0,0,0,0,0,0,0,0,0,0,0,0,0,0,0,0,0,0,0,0,0,0,0,0,0,0,0,0,0,0,0,0,0,0,0,0,0,0,0,0,0,0,0,0,0,0,{"$f":"KDQ436","v":0},0,0,0,0,0,0,0,0,0,0,0,0,0,0,0,0,0,0,0,0,0,0,0,0,0,0,0,0,0,0,0,0,0,0,0,0,0,0,0,0,0,0,0,0,0,0,0,0,0,0,0,0,0,0,0,0,0,0,0,0,0,0,0,{"$f":"KGC436","v":0},0,0,0,0,0,0,0,0,0,0,0,0,0,0,0,0,0,0,0,0,0,0,0,0,0,0,0,0,0,0,0,0,0,0,0,0,0,0,0,0,0,0,0,0,0,0,0,0,0,0,0,0,0,0,0,0,0,0,0,0,0,0,0,{"$f":"KIO436","v":0},0,0,0,0,0,0,0,0,0,0,0,0,0,0,0,0,0,0,0,0,0,0,0,0,0,0,0,0,0,0,0,0,0,0,0,0,0,0,0,0,0,0,0,0,0,0,0,0,0,0,0,0,0,0,0,0,0,0,0,0,0,0,0,{"$f":"KLA436","v":0},0,0,0,0,0,0,0,0,0,0,0,0,0,0,0,0,0,0,0,0,0,0,0,0,0,0,0,0,0,0,0,0,0,0,0,0,0,0,0,0,0,0,0,0,0,0,0,0,0,0,0,0,0,0,0,0,0,0,0,0,0,0,0,{"$f":"KNM436","v":0},0,0,0,0,0,0,0,0,0,0,0,0,0,0,0,0,0,0,0,0,0,0,0,0,0,0,0,0,0,0,0,0,0,0,0,0,0,0,0,0,0,0,0,0,0,0,0,0,0,0,0,0,0,0,0,0,0,0,0,0,0,0,0,{"$f":"KPY436","v":0},0,0,0,0,0,0,0,0,0,0,0,0,0,0,0,0,0,0,0,0,0,0,0,0,0,0,0,0,0,0,0,0,0,0,0,0,0,0,0,0,0,0,0,0,0,0,0,0,0,0,0,0,0,0,0,0,0,0,0,0,0,0,0,{"$f":"KSK436","v":0},0,0,0,0,0,0,0,0,0,0,0,0,0,0,0,0,0,0,0,0,0,0,0,0,0,0,0,0,0,0,0,0,0,0,0,0,0,0,0,0,0,0,0,0,0,0,0,0,0,0,0,0,0,0,0,0,0,0,0,0,0,0,0,{"$f":"KUW436","v":0},0,0,0,0,0,0,0,0,0,0,0,0,0,0,0,0,0,0,0,0,0,0,0,0,0,0,0,0,0,0,0,0,0,0,0,0,0,0,0,0,0,0,0,0,0,0,0,0,0,0,0,0,0,0,0,0,0,0,0,0,0,0,0,{"$f":"KXI436","v":0},0,0,0,0,0,0,0,0,0,0,0,0,0,0,0,0,0,0,0,0,0,0,0,0,0,0,0,0,0,0,0,0,0,0,0,0,0,0,0,0,0,0,0,0,0,0,0,0,0,0,0,0,0,0,0,0,0,0,0,0,0,0,0,{"$f":"KZU436","v":0},0,0,0,0,0,0,0,0,0,0,0,0,0,0,0,0,0,0,0,0,0,0,0,0,0,0,0,0,0,0,0,0,0,0,0,0,0,0,0,0,0,0,0,0,0,0,0,0,0,0,0,0,0,0,0,0,0,0,0,0,0,0,0,{"$f":"LCG436","v":0},0,0,0,0,0,0,0,0,0,0,0,0,0,0,0,0,0,0,0,0,0,0,0,0,0,0,0,0,0,0,0,0,0,0,0,0,0,0,0,0,0,0,0,0,0,0,0,0,0,0,0,0,0,0,0,0,0,0,0,0,0,0,0,{"$f":"LES436","v":0},0,0,0,0,0,0,0,0,0,0,0,0,0,0,0,0,0,0,0,0,0,0,0,0,0,0,0,0,0,0,0,0,0,0,0,0,0,0,0,0,0,0,0,0,0,0,0,0,0,0,0,0,0,0,0,0,0,0,0,0,0,0,0,{"$f":"LHE436","v":0},0,0,0,0,0,0,0,0,0,0,0,0,0,0,0,0,0,0,0,0,0,0,0,0,0,0,0,0,0,0,0,0,0,0,0,0,0,0,0,0,0,0,0,0,0,0,0,0,0,0,0,0,0,0,0,0,0,0,0,0,0,0,0,{"$f":"LJQ436","v":0},0,0,0,0,0,0,0,0,0,0,0,0,0,0,0,0,0,0,0,0,0,0,0,0,0,0,0,0,0,0,0,0,0,0,0,0,0,0,0,0,0,0,0,0,0,0,0,0,0,0,0,0,0,0,0,0,0,0,0,0,0,0,0,{"$f":"LMC436","v":0},0,0,0,0,0,0,0,0,0,0,0,0,0,0,0,0,0,0,0,0,0,0,0,0,0,0,0,0,0,0,0,0,0,0,0,0,0,0,0,0,0,0,0,0,0,0,0,0,0,0,0,0,0,0,0,0,0,0,0,0,0,0,0,{"$f":"LOO436","v":0},0,0,0,0,0,0,0,0,0,0,0,0,0,0,0,0,0,0,0,0,0,0,0,0,0,0,0,0,0,0,0,0,0,0,0,0,0,0,0,0,0,0,0,0,0,0,0,0,0,0,0,0,0,0,0,0,0,0,0,0,0,0,0,{"$f":"LRA436","v":0},0,0,0,0,0,0,0,0,0,0,0,0,0,0,0,0,0,0,0,0,0,0,0,0,0,0,0,0,0,0,0,0,0,0,0,0,0,0,0,0,0,0,0,0,0,0,0,0,0,0,0,0,0,0,0,0,0,0,0,0,0,0,0,{"$f":"LTM436","v":0},0,0,0,0,0,0,0,0,0,0,0,0,0,0,0,0,0,0,0,0,0,0,0,0,0,0,0,0,0,0,0,0,0,0,0,0,0,0,0,0,0,0,0,0,0,0,0,0,0,0,0,0,0,0,0,0,0,0,0,0,0,0,0,{"$f":"LVY436","v":0},0,0,0,0,0,0,0,0,0,0,0,0,0,0,0,0,0,0,0,0,0,0,0,0,0,0,0,0,0,0,0,0,0,0,0,0,0,0,0,0,0,0,0,0,0,0,0,0,0,0,0,0,0,0,0,0,0,0,0,0,0,0,0,{"$f":"LYK436","v":0},0,0,0,0,0,0,0,0,0,0,0,0,0,0,0,0,0,0,0,0,0,0,0,0,0,0,0,0,0,0,0,0,0,0,0,0,0,0,0,0,0,0,0,0,0,0,0,0,0,0,0,0,0,0,0,0,0,0,0,0,0,0,0,{"$f":"MAW436","v":0},0,0,0,0,0,0,0,0,0,0,0,0,0,0,0,0,0,0,0,0,0,0,0,0,0,0,0,0,0,0,0,0,0,0,0,0,0,0,0,0,0,0,0,0,0,0,0,0,0,0,0,0,0,0,0,0,0,0,0,0,0,0,0,{"$f":"MDI436","v":0},0,0,0,0,0,0,0,0,0,0,0,0,0,0,0,0,0,0,0,0,0,0,0,0,0,0,0,0,0,0,0,0,0,0,0,0,0,0,0,0,0,0,0,0,0,0,0,0,0,0,0,0,0,0,0,0,0,0,0,0,0,0,0,{"$f":"MFU436","v":0},0,0,0,0,0,0,0,0,0,0,0,0,0,0,0,0,0,0,0,0,0,0,0,0,0,0,0,0,0,0,0,0,0,0,0,0,0,0,0,0,0,0,0,0,0,0,0,0,0,0,0,0,0,0,0,0,0,0,0,0,0,0,0,{"$f":"MIG436","v":0},0,0,0,0,0,0,0,0,0,0,0,0,0,0,0,0,0,0,0,0,0,0,0,0,0,0,0,0,0,0,0,0,0,0,0,0,0,0,0,0,0,0,0,0,0,0,0,0,0,0,0,0,0,0,0,0,0,0,0,0,0,0,0,{"$f":"MKS436","v":0},0,0,0,0,0,0,0,0,0,0,0,0,0,0,0,0,0,0,0,0,0,0,0,0,0,0,0,0,0,0,0,0,0,0,0,0,0,0,0,0,0,0,0,0,0,0,0,0,0,0,0,0,0,0,0,0,0,0,0,0,0,0,0,{"$f":"MNE436","v":0},0,0,0,0,0,0,0,0,0,0,0,0,0,0,0,0,0,0,0,0,0,0,0,0,0,0,0,0,0,0,0,0,0,0,0,0,0,0,0,0,0,0,0,0,0,0,0,0,0,0,0,0,0,0,0,0,0,0,0,0,0,0,0,{"$f":"MPQ436","v":0},0,0,0,0,0,0,0,0,0,0,0,0,0,0,0,0,0,0,0,0,0,0,0,0,0,0,0,0,0,0,0,0,0,0,0,0,0,0,0,0,0,0,0,0,0,0,0,0,0,0,0,0,0,0,0,0,0,0,0,0,0,0,0,{"$f":"MSC436","v":0},0,0,0,0,0,0,0,0,0,0,0,0,0,0,0,0,0,0,0,0,0,0,0,0,0,0,0,0,0,0,0,0,0,0,0,0,0,0,0,0,0,0,0,0,0,0,0,0,0,0,0,0,0,0,0,0,0,0,0,0,0,0,0,{"$f":"MUO436","v":0},0,0,0,0,0,0,0,0,0,0,0,0,0,0,0,0,0,0,0,0,0,0,0,0,0,0,0,0,0,0,0,0,0,0,0,0,0,0,0,0,0,0,0,0,0,0,0,0,0,0,0,0,0,0,0,0,0,0,0,0,0,0,0,{"$f":"MXA436","v":0},0,0,0,0,0,0,0,0,0,0,0,0,0,0,0,0,0,0,0,0,0,0,0,0,0,0,0,0,0,0,0,0,0,0,0,0,0,0,0,0,0,0,0,0,0,0,0,0,0,0,0,0,0,0,0,0,0,0,0,0,0,0,0,{"$f":"MZM436","v":0},0,0,0,0,0,0,0,0,0,0,0,0,0,0,0,0,0,0,0,0,0,0,0,0,0,0,0,0,0,0,0,0,0,0,0,0,0,0,0,0,0,0,0,0,0,0,0,0,0,0,0,0,0,0,0,0,0,0,0,0,0,0,0,{"$f":"NBY436","v":0},0,0,0,0,0,0,0,0,0,0,0,0,0,0,0,0,0,0,0,0,0,0,0,0,0,0,0,0,0,0,0,0,0,0,0,0,0,0,0,0,0,0,0,0,0,0,0,0,0,0,0,0,0,0,0,0,0,0,0,0,0,0,0,{"$f":"NEK436","v":0},0,0,0,0,0,0,0,0,0,0,0,0,0,0,0,0,0,0,0,0,0,0,0,0,0,0,0,0,0,0,0,0,0,0,0,0,0,0,0,0,0,0,0,0,0,0,0,0,0,0,0,0,0,0,0,0,0,0,0,0,0,0,0,{"$f":"NGW436","v":0},0,0,0,0,0,0,0,0,0,0,0,0,0,0,0,0,0,0,0,0,0,0,0,0,0,0,0,0,0,0,0,0,0,0,0,0,0,0,0,0,0,0,0,0,0,0,0,0,0,0,0,0,0,0,0,0,0,0,0,0,0,0,0,{"$f":"NJI436","v":0},0,0,0,0,0,0,0,0,0,0,0,0,0,0,0,0,0,0,0,0,0,0,0,0,0,0,0,0,0,0,0,0,0,0,0,0,0,0,0,0,0,0,0,0,0,0,0,0,0,0,0,0,0,0,0,0,0,0,0,0,0,0,0,{"$f":"NLU436","v":0},0,0,0,0,0,0,0,0,0,0,0,0,0,0,0,0,0,0,0,0,0,0,0,0,0,0,0,0,0,0,0,0,0,0,0,0,0,0,0,0,0,0,0,0,0,0,0,0,0,0,0,0,0,0,0,0,0,0,0,0,0,0,0,{"$f":"NOG436","v":0},0,0,0,0,0,0,0,0,0,0,0,0,0,0,0,0,0,0,0,0,0,0,0,0,0,0,0,0,0,0,0,0,0,0,0,0,0,0,0,0,0,0,0,0,0,0,0,0,0,0,0,0,0,0,0,0,0,0,0,0,0,0,0,{"$f":"NQS436","v":0},0,0,0,0,0,0,0,0,0,0,0,0,0,0,0,0,0,0,0,0,0,0,0,0,0,0,0,0,0,0,0,0,0,0,0,0,0,0,0,0,0,0,0,0,0,0,0,0,0,0,0,0,0,0,0,0,0,0,0,0,0,0,0,{"$f":"NTE436","v":0},0,0,0,0,0,0,0,0,0,0,0,0,0,0,0,0,0,0,0,0,0,0,0,0,0,0,0,0,0,0,0,0,0,0,0,0,0,0,0,0,0,0,0,0,0,0,0,0,0,0,0,0,0,0,0,0,0,0,0,0,0,0,0,{"$f":"NVQ436","v":0},0,0,0,0,0,0,0,0,0,0,0,0,0,0,0,0,0,0,0,0,0,0,0,0,0,0,0,0,0,0,0,0,0,0,0,0,0,0,0,0,0,0,0,0,0,0,0,0,0,0,0,0,0,0,0,0,0,0,0,0,0,0,0,{"$f":"NYC436","v":0},0,0,0,0,0,0,0,0,0,0,0,0,0,0,0,0,0,0,0,0,0,0,0,0,0,0,0,0,0,0,0,0,0,0,0,0,0,0,0,0,0,0,0,0,0,0,0,0,0,0,0,0,0,0,0,0,0,0,0,0,0,0,0,{"$f":"OAO436","v":0},0,0,0,0,0,0,0,0,0,0,0,0,0,0,0,0,0,0,0,0,0,0,0,0,0,0,0,0,0,0,0,0,0,0,0,0,0,0,0,0,0,0,0,0,0,0,0,0,0,0,0,0,0,0,0,0,0,0,0,0,0,0,0,{"$f":"ODA436","v":0},0,0,0,0,0,0,0,0,0,0,0,0,0,0,0,0,0,0,0,0,0,0,0,0,0,0,0,0,0,0,0,0,0,0,0,0,0,0,0,0,0,0,0,0,0,0,0,0,0,0,0,0,0,0,0,0,0,0,0,0,0,0,0,{"$f":"OFM436","v":0},0,0,0,0,0,0,0,0,0,0,0,0,0,0,0,0,0,0,0,0,0,0,0,0,0,0,0,0,0,0,0,0,0,0,0,0,0,0,0,0,0,0,0,0,0,0,0,0,0,0,0,0,0,0,0,0,0,0,0,0,0,0,0,{"$f":"OHY436","v":0},0,0,0,0,0,0,0,0,0,0,0,0,0,0,0,0,0,0,0,0,0,0,0,0,0,0,0,0,0,0,0,0,0,0,0,0,0,0,0,0,0,0,0,0,0,0,0,0,0,0,0,0,0,0,0,0,0,0,0,0,0,0,0,{"$f":"OKK436","v":0},0,0,0,0,0,0,0,0,0,0,0,0,0,0,0,0,0,0,0,0,0,0,0,0,0,0,0,0,0,0,0,0,0,0,0,0,0,0,0,0,0,0,0,0,0,0,0,0,0,0,0,0,0,0,0,0,0,0,0,0,0,0,0,{"$f":"OMW436","v":0},0,0,0,0,0,0,0,0,0,0,0,0,0,0,0,0,0,0,0,0,0,0,0,0,0,0,0,0,0,0,0,0,0,0,0,0,0,0,0,0,0,0,0,0,0,0,0,0,0,0,0,0,0,0,0,0,0,0,0,0,0,0,0,{"$f":"OPI436","v":0},0,0,0,0,0,0,0,0,0,0,0,0,0,0,0,0,0,0,0,0,0,0,0,0,0,0,0,0,0,0,0,0,0,0,0,0,0,0,0,0,0,0,0,0,0,0,0,0,0,0,0,0,0,0,0,0,0,0,0,0,0,0,0,{"$f":"ORU436","v":0},0,0,0,0,0,0,0,0,0,0,0,0,0,0,0,0,0,0,0,0,0,0,0,0,0,0,0,0,0,0,0,0,0,0,0,0,0,0,0,0,0,0,0,0,0,0,0,0,0,0,0,0,0,0,0,0,0,0,0,0,0,0,0,{"$f":"OUG436","v":0},0,0,0,0,0,0,0,0,0,0,0,0,0,0,0,0,0,0,0,0,0,0,0,0,0,0,0,0,0,0,0,0,0,0,0,0,0,0,0,0,0,0,0,0,0,0,0,0,0,0,0,0,0,0,0,0,0,0,0,0,0,0,0,{"$f":"OWS436","v":0},0,0,0,0,0,0,0,0,0,0,0,0,0,0,0,0,0,0,0,0,0,0,0,0,0,0,0,0,0,0,0,0,0,0,0,0,0,0,0,0,0,0,0,0,0,0,0,0,0,0,0,0,0,0,0,0,0,0,0,0,0,0,0,{"$f":"OZE436","v":0},0,0,0,0,0,0,0,0,0,0,0,0,0,0,0,0,0,0,0,0,0,0,0,0,0,0,0,0,0,0,0,0,0,0,0,0,0,0,0,0,0,0,0,0,0,0,0,0,0,0,0,0,0,0,0,0,0,0,0,0,0,0,0,{"$f":"PBQ436","v":0},0,0,0,0,0,0,0,0,0,0,0,0,0,0,0,0,0,0,0,0,0,0,0,0,0,0,0,0,0,0,0,0,0,0,0,0,0,0,0,0,0,0,0,0,0,0,0,0,0,0,0,0,0,0,0,0,0,0,0,0,0,0,0,{"$f":"PEC436","v":0},0,0,0,0,0,0,0,0,0,0,0,0,0,0,0,0,0,0,0,0,0,0,0,0,0,0,0,0,0,0,0,0,0,0,0,0,0,0,0,0,0,0,0,0,0,0,0,0,0,0,0,0,0,0,0,0,0,0,0,0,0,0,0,{"$f":"PGO436","v":0},0,0,0,0,0,0,0,0,0,0,0,0,0,0,0,0,0,0,0,0,0,0,0,0,0,0,0,0,0,0,0,0,0,0,0,0,0,0,0,0,0,0,0,0,0,0,0,0,0,0,0,0,0,0,0,0,0,0,0,0,0,0,0,{"$f":"PJA436","v":0},0,0,0,0,0,0,0,0,0,0,0,0,0,0,0,0,0,0,0,0,0,0,0,0,0,0,0,0,0,0,0,0,0,0,0,0,0,0,0,0,0,0,0,0,0,0,0,0,0,0,0,0,0,0,0,0,0,0,0,0,0,0,0,{"$f":"PLM436","v":0},0,0,0,0,0,0,0,0,0,0,0,0,0,0,0,0,0,0,0,0,0,0,0,0,0,0,0,0,0,0,0,0,0,0,0,0,0,0,0,0,0,0,0,0,0,0,0,0,0,0,0,0,0,0,0,0,0,0,0,0,0,0,0,{"$f":"PNY436","v":0},0,0,0,0,0,0,0,0,0,0,0,0,0,0,0,0,0,0,0,0,0,0,0,0,0,0,0,0,0,0,0,0,0,0,0,0,0,0,0,0,0,0,0,0,0,0,0,0,0,0,0,0,0,0,0,0,0,0,0,0,0,0,0,{"$f":"PQK436","v":0},0,0,0,0,0,0,0,0,0,0,0,0,0,0,0,0,0,0,0,0,0,0,0,0,0,0,0,0,0,0,0,0,0,0,0,0,0,0,0,0,0,0,0,0,0,0,0,0,0,0,0,0,0,0,0,0,0,0,0,0,0,0,0,{"$f":"PSW436","v":0},0,0,0,0,0,0,0,0,0,0,0,0,0,0,0,0,0,0,0,0,0,0,0,0,0,0,0,0,0,0,0,0,0,0,0,0,0,0,0,0,0,0,0,0,0,0,0,0,0,0,0,0,0,0,0,0,0,0,0,0,0,0,0,{"$f":"PVI436","v":0},0,0,0,0,0,0,0,0,0,0,0,0,0,0,0,0,0,0,0,0,0,0,0,0,0,0,0,0,0,0,0,0,0,0,0,0,0,0,0,0,0,0,0,0,0,0,0,0,0,0,0,0,0,0,0,0,0,0,0,0,0,0,0,{"$f":"PXU436","v":0},0,0,0,0,0,0,0,0,0,0,0,0,0,0,0,0,0,0,0,0,0,0,0,0,0,0,0,0,0,0,0,0,0,0,0,0,0,0,0,0,0,0,0,0,0,0,0,0,0,0,0,0,0,0,0,0,0,0,0,0,0,0,0,{"$f":"QAG436","v":0},0,0,0,0,0,0,0,0,0,0,0,0,0,0,0,0,0,0,0,0,0,0,0,0,0,0,0,0,0,0,0,0,0,0,0,0,0,0,0,0,0,0,0,0,0,0,0,0,0,0,0,0,0,0,0,0,0,0,0,0,0,0,0,{"$f":"QCS436","v":0},0,0,0,0,0,0,0,0,0,0,0,0,0,0,0,0,0,0,0,0,0,0,0,0,0,0,0,0,0,0,0,0,0,0,0,0,0,0,0,0,0,0,0,0,0,0,0,0,0,0,0,0,0,0,0,0,0,0,0,0,0,0,0,{"$f":"QFE436","v":0},0,0,0,0,0,0,0,0,0,0,0,0,0,0,0,0,0,0,0,0,0,0,0,0,0,0,0,0,0,0,0,0,0,0,0,0,0,0,0,0,0,0,0,0,0,0,0,0,0,0,0,0,0,0,0,0,0,0,0,0,0,0,0,{"$f":"QHQ436","v":0},0,0,0,0,0,0,0,0,0,0,0,0,0,0,0,0,0,0,0,0,0,0,0,0,0,0,0,0,0,0,0,0,0,0,0,0,0,0,0,0,0,0,0,0,0,0,0,0,0,0,0,0,0,0,0,0,0,0,0,0,0,0,0,{"$f":"QKC436","v":0},0,0,0,0,0,0,0,0,0,0,0,0,0,0,0,0,0,0,0,0,0,0,0,0,0,0,0,0,0,0,0,0,0,0,0,0,0,0,0,0,0,0,0,0,0,0,0,0,0,0,0,0,0,0,0,0,0,0,0,0,0,0,0,{"$f":"QMO436","v":0},0,0,0,0,0,0,0,0,0,0,0,0,0,0,0,0,0,0,0,0,0,0,0,0,0,0,0,0,0,0,0,0,0,0,0,0,0,0,0,0,0,0,0,0,0,0,0,0,0,0,0,0,0,0,0,0,0,0,0,0,0,0,0,{"$f":"QPA436","v":0},0,0,0,0,0,0,0,0,0,0,0,0,0,0,0,0,0,0,0,0,0,0,0,0,0,0,0,0,0,0,0,0,0,0,0,0,0,0,0,0,0,0,0,0,0,0,0,0,0,0,0,0,0,0,0,0,0,0,0,0,0,0,0,{"$f":"QRM436","v":0},0,0,0,0,0,0,0,0,0,0,0,0,0,0,0,0,0,0,0,0,0,0,0,0,0,0,0,0,0,0,0,0,0,0,0,0,0,0,0,0,0,0,0,0,0,0,0,0,0,0,0,0,0,0,0,0,0,0,0,0,0,0,0,{"$f":"QTY436","v":0},0,0,0,0,0,0,0,0,0,0,0,0,0,0,0,0,0,0,0,0,0,0,0,0,0,0,0,0,0,0,0,0,0,0,0,0,0,0,0,0,0,0,0,0,0,0,0,0,0,0,0,0,0,0,0,0,0,0,0,0,0,0,0,{"$f":"QWK436","v":0},0,0,0,0,0,0,0,0,0,0,0,0,0,0,0,0,0,0,0,0,0,0,0,0,0,0,0,0,0,0,0,0,0,0,0,0,0,0,0,0,0,0,0,0,0,0,0,0,0,0,0,0,0,0,0,0,0,0,0,0,0,0,0,{"$f":"QYW436","v":0},0,0,0,0,0,0,0,0,0,0,0,0,0,0,0,0,0,0,0,0,0,0,0,0,0,0,0,0,0,0,0,0,0,0,0,0,0,0,0,0,0,0,0,0,0,0,0,0,0,0,0,0,0,0,0,0,0,0,0,0,0,0,0,{"$f":"RBI436","v":0},0,0,0,0,0,0,0,0,0,0,0,0,0,0,0,0,0,0,0,0,0,0,0,0,0,0,0,0,0,0,0,0,0,0,0,0,0,0,0,0,0,0,0,0,0,0,0,0,0,0,0,0,0,0,0,0,0,0,0,0,0,0,0,{"$f":"RDU436","v":0},0,0,0,0,0,0,0,0,0,0,0,0,0,0,0,0,0,0,0,0,0,0,0,0,0,0,0,0,0,0,0,0,0,0,0,0,0,0,0,0,0,0,0,0,0,0,0,0,0,0,0,0,0,0,0,0,0,0,0,0,0,0,0,{"$f":"RGG436","v":0},0,0,0,0,0,0,0,0,0,0,0,0,0,0,0,0,0,0,0,0,0,0,0,0,0,0,0,0,0,0,0,0,0,0,0,0,0,0,0,0,0,0,0,0,0,0,0,0,0,0,0,0,0,0,0,0,0,0,0,0,0,0,0,{"$f":"RIS436","v":0},0,0,0,0,0,0,0,0,0,0,0,0,0,0,0,0,0,0,0,0,0,0,0,0,0,0,0,0,0,0,0,0,0,0,0,0,0,0,0,0,0,0,0,0,0,0,0,0,0,0,0,0,0,0,0,0,0,0,0,0,0,0,0,{"$f":"RLE436","v":0},0,0,0,0,0,0,0,0,0,0,0,0,0,0,0,0,0,0,0,0,0,0,0,0,0,0,0,0,0,0,0,0,0,0,0,0,0,0,0,0,0,0,0,0,0,0,0,0,0,0,0,0,0,0,0,0,0,0,0,0,0,0,0,{"$f":"RNQ436","v":0},0,0,0,0,0,0,0,0,0,0,0,0,0,0,0,0,0,0,0,0,0,0,0,0,0,0,0,0,0,0,0,0,0,0,0,0,0,0,0,0,0,0,0,0,0,0,0,0,0,0,0,0,0,0,0,0,0,0,0,0,0,0,0,{"$f":"RQC436","v":0},0,0,0,0,0,0,0,0,0,0,0,0,0,0,0,0,0,0,0,0,0,0,0,0,0,0,0,0,0,0,0,0,0,0,0,0,0,0,0,0,0,0,0,0,0,0,0,0,0,0,0,0,0,0,0,0,0,0,0,0,0,0,0,{"$f":"RSO436","v":0},0,0,0,0,0,0,0,0,0,0,0,0,0,0,0,0,0,0,0,0,0,0,0,0,0,0,0,0,0,0,0,0,0,0,0,0,0,0,0,0,0,0,0,0,0,0,0,0,0,0,0,0,0,0,0,0,0,0,0,0,0,0,0,{"$f":"RVA436","v":0},0,0,0,0,0,0,0,0,0,0,0,0,0,0,0,0,0,0,0,0,0,0,0,0,0,0,0,0,0,0,0,0,0,0,0,0,0,0,0,0,0,0,0,0,0,0,0,0,0,0,0,0,0,0,0,0,0,0,0,0,0,0,0,{"$f":"RXM436","v":0},0,0,0,0,0,0,0,0,0,0,0,0,0,0,0,0,0,0,0,0,0,0,0,0,0,0,0,0,0,0,0,0,0,0,0,0,0,0,0,0,0,0,0,0,0,0,0,0,0,0,0,0,0,0,0,0,0,0,0,0,0,0,0,{"$f":"RZY436","v":0},0,0,0,0,0,0,0,0,0,0,0,0,0,0,0,0,0,0,0,0,0,0,0,0,0,0,0,0,0,0,0,0,0,0,0,0,0,0,0,0,0,0,0,0,0,0,0,0,0,0,0,0,0,0,0,0,0,0,0,0,0,0,0,{"$f":"SCK436","v":0},0,0,0,0,0,0,0,0,0,0,0,0,0,0,0,0,0,0,0,0,0,0,0,0,0,0,0,0,0,0,0,0,0,0,0,0,0,0,0,0,0,0,0,0,0,0,0,0,0,0,0,0,0,0,0,0,0,0,0,0,0,0,0,{"$f":"SEW436","v":0},0,0,0,0,0,0,0,0,0,0,0,0,0,0,0,0,0,0,0,0,0,0,0,0,0,0,0,0,0,0,0,0,0,0,0,0,0,0,0,0,0,0,0,0,0,0,0,0,0,0,0,0,0,0,0,0,0,0,0,0,0,0,0,{"$f":"SHI436","v":0},0,0,0,0,0,0,0,0,0,0,0,0,0,0,0,0,0,0,0,0,0,0,0,0,0,0,0,0,0,0,0,0,0,0,0,0,0,0,0,0,0,0,0,0,0,0,0,0,0,0,0,0,0,0,0,0,0,0,0,0,0,0,0,{"$f":"SJU436","v":0},0,0,0,0,0,0,0,0,0,0,0,0,0,0,0,0,0,0,0,0,0,0,0,0,0,0,0,0,0,0,0,0,0,0,0,0,0,0,0,0,0,0,0,0,0,0,0,0,0,0,0,0,0,0,0,0,0,0,0,0,0,0,0,{"$f":"SMG436","v":0},0,0,0,0,0,0,0,0,0,0,0,0,0,0,0,0,0,0,0,0,0,0,0,0,0,0,0,0,0,0,0,0,0,0,0,0,0,0,0,0,0,0,0,0,0,0,0,0,0,0,0,0,0,0,0,0,0,0,0,0,0,0,0,{"$f":"SOS436","v":0},0,0,0,0,0,0,0,0,0,0,0,0,0,0,0,0,0,0,0,0,0,0,0,0,0,0,0,0,0,0,0,0,0,0,0,0,0,0,0,0,0,0,0,0,0,0,0,0,0,0,0,0,0,0,0,0,0,0,0,0,0,0,0,{"$f":"SRE436","v":0},0,0,0,0,0,0,0,0,0,0,0,0,0,0,0,0,0,0,0,0,0,0,0,0,0,0,0,0,0,0,0,0,0,0,0,0,0,0,0,0,0,0,0,0,0,0,0,0,0,0,0,0,0,0,0,0,0,0,0,0,0,0,0,{"$f":"STQ436","v":0},0,0,0,0,0,0,0,0,0,0,0,0,0,0,0,0,0,0,0,0,0,0,0,0,0,0,0,0,0,0,0,0,0,0,0,0,0,0,0,0,0,0,0,0,0,0,0,0,0,0,0,0,0,0,0,0,0,0,0,0,0,0,0,{"$f":"SWC436","v":0},0,0,0,0,0,0,0,0,0,0,0,0,0,0,0,0,0,0,0,0,0,0,0,0,0,0,0,0,0,0,0,0,0,0,0,0,0,0,0,0,0,0,0,0,0,0,0,0,0,0,0,0,0,0,0,0,0,0,0,0,0,0,0,{"$f":"SYO436","v":0},0,0,0,0,0,0,0,0,0,0,0,0,0,0,0,0,0,0,0,0,0,0,0,0,0,0,0,0,0,0,0,0,0,0,0,0,0,0,0,0,0,0,0,0,0,0,0,0,0,0,0,0,0,0,0,0,0,0,0,0,0,0,0,{"$f":"TBA436","v":0},0,0,0,0,0,0,0,0,0,0,0,0,0,0,0,0,0,0,0,0,0,0,0,0,0,0,0,0,0,0,0,0,0,0,0,0,0,0,0,0,0,0,0,0,0,0,0,0,0,0,0,0,0,0,0,0,0,0,0,0,0,0,0,{"$f":"TDM436","v":0},0,0,0,0,0,0,0,0,0,0,0,0,0,0,0,0,0,0,0,0,0,0,0,0,0,0,0,0,0,0,0,0,0,0,0,0,0,0,0,0,0,0,0,0,0,0,0,0,0,0,0,0,0,0,0,0,0,0,0,0,0,0,0,{"$f":"TFY436","v":0},0,0,0,0,0,0,0,0,0,0,0,0,0,0,0,0,0,0,0,0,0,0,0,0,0,0,0,0,0,0,0,0,0,0,0,0,0,0,0,0,0,0,0,0,0,0,0,0,0,0,0,0,0,0,0,0,0,0,0,0,0,0,0,{"$f":"TIK436","v":0},0,0,0,0,0,0,0,0,0,0,0,0,0,0,0,0,0,0,0,0,0,0,0,0,0,0,0,0,0,0,0,0,0,0,0,0,0,0,0,0,0,0,0,0,0,0,0,0,0,0,0,0,0,0,0,0,0,0,0,0,0,0,0,{"$f":"TKW436","v":0},0,0,0,0,0,0,0,0,0,0,0,0,0,0,0,0,0,0,0,0,0,0,0,0,0,0,0,0,0,0,0,0,0,0,0,0,0,0,0,0,0,0,0,0,0,0,0,0,0,0,0,0,0,0,0,0,0,0,0,0,0,0,0,{"$f":"TNI436","v":0},0,0,0,0,0,0,0,0,0,0,0,0,0,0,0,0,0,0,0,0,0,0,0,0,0,0,0,0,0,0,0,0,0,0,0,0,0,0,0,0,0,0,0,0,0,0,0,0,0,0,0,0,0,0,0,0,0,0,0,0,0,0,0,{"$f":"TPU436","v":0},0,0,0,0,0,0,0,0,0,0,0,0,0,0,0,0,0,0,0,0,0,0,0,0,0,0,0,0,0,0,0,0,0,0,0,0,0,0,0,0,0,0,0,0,0,0,0,0,0,0,0,0,0,0,0,0,0,0,0,0,0,0,0,{"$f":"TSG436","v":0},0,0,0,0,0,0,0,0,0,0,0,0,0,0,0,0,0,0,0,0,0,0,0,0,0,0,0,0,0,0,0,0,0,0,0,0,0,0,0,0,0,0,0,0,0,0,0,0,0,0,0,0,0,0,0,0,0,0,0,0,0,0,0,{"$f":"TUS436","v":0},0,0,0,0,0,0,0,0,0,0,0,0,0,0,0,0,0,0,0,0,0,0,0,0,0,0,0,0,0,0,0,0,0,0,0,0,0,0,0,0,0,0,0,0,0,0,0,0,0,0,0,0,0,0,0,0,0,0,0,0,0,0,0,{"$f":"TXE436","v":0},0,0,0,0,0,0,0,0,0,0,0,0,0,0,0,0,0,0,0,0,0,0,0,0,0,0,0,0,0,0,0,0,0,0,0,0,0,0,0,0,0,0,0,0,0,0,0,0,0,0,0,0,0,0,0,0,0,0,0,0,0,0,0,{"$f":"TZQ436","v":0},0,0,0,0,0,0,0,0,0,0,0,0,0,0,0,0,0,0,0,0,0,0,0,0,0,0,0,0,0,0,0,0,0,0,0,0,0,0,0,0,0,0,0,0,0,0,0,0,0,0,0,0,0,0,0,0,0,0,0,0,0,0,0,{"$f":"UCC436","v":0},0,0,0,0,0,0,0,0,0,0,0,0,0,0,0,0,0,0,0,0,0,0,0,0,0,0,0,0,0,0,0,0,0,0,0,0,0,0,0,0,0,0,0,0,0,0,0,0,0,0,0,0,0,0,0,0,0,0,0,0,0,0,0,{"$f":"UEO436","v":0},0,0,0,0,0,0,0,0,0,0,0,0,0,0,0,0,0,0,0,0,0,0,0,0,0,0,0,0,0,0,0,0,0,0,0,0,0,0,0,0,0,0,0,0,0,0,0,0,0,0,0,0,0,0,0,0,0,0,0,0,0,0,0,{"$f":"UHA436","v":0},0,0,0,0,0,0,0,0,0,0,0,0,0,0,0,0,0,0,0,0,0,0,0,0,0,0,0,0,0,0,0,0,0,0,0,0,0,0,0,0,0,0,0,0,0,0,0,0,0,0,0,0,0,0,0,0,0,0,0,0,0,0,0,{"$f":"UJM436","v":0},0,0,0,0,0,0,0,0,0,0,0,0,0,0,0,0,0,0,0,0,0,0,0,0,0,0,0,0,0,0,0,0,0,0,0,0,0,0,0,0,0,0,0,0,0,0,0,0,0,0,0,0,0,0,0,0,0,0,0,0,0,0,0,{"$f":"ULY436","v":0},0,0,0,0,0,0,0,0,0,0,0,0,0,0,0,0,0,0,0,0,0,0,0,0,0,0,0,0,0,0,0,0,0,0,0,0,0,0,0,0,0,0,0,0,0,0,0,0,0,0,0,0,0,0,0,0,0,0,0,0,0,0,0,{"$f":"UOK436","v":0},0,0,0,0,0,0,0,0,0,0,0,0,0,0,0,0,0,0,0,0,0,0,0,0,0,0,0,0,0,0,0,0,0,0,0,0,0,0,0,0,0,0,0,0,0,0,0,0,0,0,0,0,0,0,0,0,0,0,0,0,0,0,0,{"$f":"UQW436","v":0},0,0,0,0,0,0,0,0,0,0,0,0,0,0,0,0,0,0,0,0,0,0,0,0,0,0,0,0,0,0,0,0,0,0,0,0,0,0,0,0,0,0,0,0,0,0,0,0,0,0,0,0,0,0,0,0,0,0,0,0,0,0,0,{"$f":"UTI436","v":0},0,0,0,0,0,0,0,0,0,0,0,0,0,0,0,0,0,0,0,0,0,0,0,0,0,0,0,0,0,0,0,0,0,0,0,0,0,0,0,0,0,0,0,0,0,0,0,0,0,0,0,0,0,0,0,0,0,0,0,0,0,0,0,{"$f":"UVU436","v":0},0,0,0,0,0,0,0,0,0,0,0,0,0,0,0,0,0,0,0,0,0,0,0,0,0,0,0,0,0,0,0,0,0,0,0,0,0,0,0,0,0,0,0,0,0,0,0,0,0,0,0,0,0,0,0,0,0,0,0,0,0,0,0,{"$f":"UYG436","v":0},0,0,0,0,0,0,0,0,0,0,0,0,0,0,0,0,0,0,0,0,0,0,0,0,0,0,0,0,0,0,0,0,0,0,0,0,0,0,0,0,0,0,0,0,0,0,0,0,0,0,0,0,0,0,0,0,0,0,0,0,0,0,0,{"$f":"VAS436","v":0},0,0,0,0,0,0,0,0,0,0,0,0,0,0,0,0,0,0,0,0,0,0,0,0,0,0,0,0,0,0,0,0,0,0,0,0,0,0,0,0,0,0,0,0,0,0,0,0,0,0,0,0,0,0,0,0,0,0,0,0,0,0,0,{"$f":"VDE436","v":0},0,0,0,0,0,0,0,0,0,0,0,0,0,0,0,0,0,0,0,0,0,0,0,0,0,0,0,0,0,0,0,0,0,0,0,0,0,0,0,0,0,0,0,0,0,0,0,0,0,0,0,0,0,0,0,0,0,0,0,0,0,0,0,{"$f":"VFQ436","v":0},0,0,0,0,0,0,0,0,0,0,0,0,0,0,0,0,0,0,0,0,0,0,0,0,0,0,0,0,0,0,0,0,0,0,0,0,0,0,0,0,0,0,0,0,0,0,0,0,0,0,0,0,0,0,0,0,0,0,0,0,0,0,0,{"$f":"VIC436","v":0},0,0,0,0,0,0,0,0,0,0,0,0,0,0,0,0,0,0,0,0,0,0,0,0,0,0,0,0,0,0,0,0,0,0,0,0,0,0,0,0,0,0,0,0,0,0,0,0,0,0,0,0,0,0,0,0,0,0,0,0,0,0,0,{"$f":"VKO436","v":0},0,0,0,0,0,0,0,0,0,0,0,0,0,0,0,0,0,0,0,0,0,0,0,0,0,0,0,0,0,0,0,0,0,0,0,0,0,0,0,0,0,0,0,0,0,0,0,0,0,0,0,0,0,0,0,0,0,0,0,0,0,0,0,{"$f":"VNA436","v":0},0,0,0,0,0,0,0,0,0,0,0,0,0,0,0,0,0,0,0,0,0,0,0,0,0,0,0,0,0,0,0,0,0,0,0,0,0,0,0,0,0,0,0,0,0,0,0,0,0,0,0,0,0,0,0,0,0,0,0,0,0,0,0,{"$f":"VPM436","v":0},0,0,0,0,0,0,0,0,0,0,0,0,0,0,0,0,0,0,0,0,0,0,0,0,0,0,0,0,0,0,0,0,0,0,0,0,0,0,0,0,0,0,0,0,0,0,0,0,0,0,0,0,0,0,0,0,0,0,0,0,0,0,0,{"$f":"VRY436","v":0},0,0,0,0,0,0,0,0,0,0,0,0,0,0,0,0,0,0,0,0,0,0,0,0,0,0,0,0,0,0,0,0,0,0,0,0,0,0,0,0,0,0,0,0,0,0,0,0,0,0,0,0,0,0,0,0,0,0,0,0,0,0,0,{"$f":"VUK436","v":0},0,0,0,0,0,0,0,0,0,0,0,0,0,0,0,0,0,0,0,0,0,0,0,0,0,0,0,0,0,0,0,0,0,0,0,0,0,0,0,0,0,0,0,0,0,0,0,0,0,0,0,0,0,0,0,0,0,0,0,0,0,0,0,{"$f":"VWW436","v":0},0,0,0,0,0,0,0,0,0,0,0,0,0,0,0,0,0,0,0,0,0,0,0,0,0,0,0,0,0,0,0,0,0,0,0,0,0,0,0,0,0,0,0,0,0,0,0,0,0,0,0,0,0,0,0,0,0,0,0,0,0,0,0,{"$f":"VZI436","v":0},0,0,0,0,0,0,0,0,0,0,0,0,0,0,0,0,0,0,0,0,0,0,0,0,0,0,0,0,0,0,0,0,0,0,0,0,0,0,0,0,0,0,0,0,0,0,0,0,0,0,0,0,0,0,0,0,0,0,0,0,0,0,0,{"$f":"WBU436","v":0},0,0,0,0,0,0,0,0,0,0,0,0,0,0,0,0,0,0,0,0,0,0,0,0,0,0,0,0,0,0,0,0,0,0,0,0,0,0,0,0,0,0,0,0,0,0,0,0,0,0,0,0,0,0,0,0,0,0,0,0,0,0,0,{"$f":"WEG436","v":0},0,0,0,0,0,0,0,0,0,0,0,0,0,0,0,0,0,0,0,0,0,0,0,0,0,0,0,0,0,0,0,0,0,0,0,0,0,0,0,0,0,0,0,0,0,0,0,0,0,0,0,0,0,0,0,0,0,0,0,0,0,0,0,{"$f":"WGS436","v":0},0,0,0,0,0,0,0,0,0,0,0,0,0,0,0,0,0,0,0,0,0,0,0,0,0,0,0,0,0,0,0,0,0,0,0,0,0,0,0,0,0,0,0,0,0,0,0,0,0,0,0,0,0,0,0,0,0,0,0,0,0,0,0,{"$f":"WJE436","v":0},0,0,0,0,0,0,0,0,0,0,0,0,0,0,0,0,0,0,0,0,0,0,0,0,0,0,0,0,0,0,0,0,0,0,0,0,0,0,0,0,0,0,0,0,0,0,0,0,0,0,0,0,0,0,0,0,0,0,0,0,0,0,0,{"$f":"WLQ436","v":0},0,0,0,0,0,0,0,0,0,0,0,0,0,0,0,0,0,0,0,0,0,0,0,0,0,0,0,0,0,0,0,0,0,0,0,0,0,0,0,0,0,0,0,0,0,0,0,0,0,0,0,0,0,0,0,0,0,0,0,0,0,0,0,{"$f":"WOC436","v":0},0,0,0,0,0,0,0,0,0,0,0,0,0,0,0,0,0,0,0,0,0,0,0,0,0,0,0,0,0,0,0,0,0,0,0,0,0,0,0,0,0,0,0,0,0,0,0,0,0,0,0,0,0,0,0,0,0,0,0,0,0,0,0,{"$f":"WQO436","v":0},0,0,0,0,0,0,0,0,0,0,0,0,0,0,0,0,0,0,0,0,0,0,0,0,0,0,0,0,0,0,0,0,0,0,0,0,0,0,0,0,0,0,0,0,0,0,0,0,0,0,0,0,0,0,0,0,0,0,0,0,0,0,0,{"$f":"WTA436","v":0},0,0,0,0,0,0,0,0,0,0,0,0,0,0,0,0,0,0,0,0,0,0,0,0,0,0,0,0,0,0,0,0,0,0,0,0,0,0,0,0,0,0,0,0,0,0,0,0,0,0,0,0,0,0,0,0,0,0,0,0,0,0,0,{"$f":"WVM436","v":0},0,0,0,0,0,0,0,0,0,0,0,0,0,0,0,0,0,0,0,0,0,0,0,0,0,0,0,0,0,0,0,0,0,0,0,0,0,0,0,0,0,0,0,0,0,0,0,0,0,0,0,0,0,0,0,0,0,0,0,0,0,0,0,{"$f":"WXY436","v":0},0,0,0,0,0,0,0,0,0,0,0,0,0,0,0,0,0,0,0,0,0,0,0,0,0,0,0,0,0,0,0,0,0,0,0,0,0,0,0,0,0,0,0,0,0,0,0,0,0,0,0,0,0,0,0,0,0,0,0,0,0,0,0,{"$f":"XAK436","v":0},0,0,0,0,0,0,0,0,0,0,0,0,0,0,0,0,0,0,0,0,0,0,0,0,0,0,0,0,0,0,0,0,0,0,0,0,0,0,0,0,0,0,0,0,0,0,0,0,0,0,0,0,0,0,0,0,0,0,0,0,0,0,0,{"$f":"XCW436","v":0},0,0,0,0,0,0,0,0,0,0,0,0,0,0,0,0,0,0,0,0,0,0,0,0,0,0,0,0,0,0,0,0,0,0,0,0,0,0,0,0,0,0,0,0,0,0,0,0,0,0,0,0,0,0,0,0,0,0,0]
[null,null,null,null,"Net totex available for cost sharing after adjustments profiled - WWN - Real",null,"£m",{"$f":" SUM(J461:P461)","v":1228.760678566294},null,{"$f":"SUM(J457:J460)","v":0},{"$f":"SUM(K457:K460)","v":267.29612305736123},{"$f":"SUM(L457:L460)","v":248.88419854483141},244.07885328821951,240.12571883652805,228.37578483935391,0]
[]
[null,null,null,"Variance to forecast net totex for cost sharing"]
[null,null,null,null,{"$f":" E$442","v":"Actual net totex for cost sharing reconciliation - WWN - Real"},0,"£m",1246.80918623552,0,0,226.44905430382641,217.31455267423013,222.63813911276668,286.07103718083368,294.33640296386312,0]
[null,null,null,null,{"$f":" E$461","v":"Net totex available for cost sharing after adjustments profiled - WWN - Real"},0,"£m",1228.760678566294,0,0,267.29612305736123,248.88419854483141,244.07885328821951,240.12571883652805,228.37578483935391,0]
[null,null,null,null,"Variance to forecast net totex for cost sharing - WWN",null,"£m",{"$f":" SUM(J466:P466)","v":18.048507669225927},null,{"$f":" J464 - J465","v":0},-40.847068753534813,-31.569645870601278,-21.440714175452825,45.945318344305633,65.96061812450921,0]
[]
[null,null,null,"Variance to forecast net totex for cost sharing - Time adjusted"]
[null,null,null,null,{"$f":" InpActive!E$288","v":"Financing cost index"},{"$f":" InpActive!F$288","v":0},{"$f":" InpActive!G$288","v":"Index"},{"$f":" InpActive!H$288","v":0},{"$f":" InpActive!I$288","v":0},{"$f":" InpActive!J$288","v":0},{"$f":" InpActive!K$288","v":4},{"$f":" InpActive!L$288","v":3},{"$f":" InpActive!M$288","v":2},{"$f":" InpActive!N$288","v":1},{"$f":" InpActive!O$288","v":0},{"$f":" InpActive!P$288","v":0}]
[null,null,null,null,{"$f":" InpActive!E$292","v":"Real WACC CPIH Deflated - WWN"},{"$f":" InpActive!F$292","v":2.92E-2},{"$f":" InpActive!G$292","v":"%"}]
[null,null,null,null,"Time value of money factor - WWN",null,"Factor",null,null,{"$f":"(1+$F470) ^ J469","v":1},1.122016155346969,1.0901828170879997,1.0592526399999997,1.0291999999999999,1,1]
[]
[null,null,null,null,{"$f":" E$466","v":"Variance to forecast net totex for cost sharing - WWN"},0,"£m",18.048507669225927,0,0,-40.847068753534813,-31.569645870601278,-21.440714175452825,45.945318344305633,65.96061812450921,0]
[null,null,null,null,{"$f":" E$471","v":"Time value of money factor - WWN"},0,"Factor",0,0,1,1.122016155346969,1.0901828170879997,1.0592526399999997,1.0291999999999999,1,1]
[null,null,null,null,"Time adjusted variance to forecast net totex for cost sharing - WWN",null,"£m",{"$f":" SUM(J475:P475)","v":10.288650160917662},null,{"$f":" J473 * J474","v":0},-45.831071040034438,-34.416685469682641,-22.711133093833823,47.286921639959353,65.96061812450921,0]
[null,null,null,null,"Total variance to forecast net totex for cost sharing - WWN",{"$f":" $H475","v":10.288650160917662},"£m"]
[]
[null,null,null,"Under / Overperformance on net totex for cost sharing"]
[]
[null,null,null,null,{"$f":" E$476","v":"Total variance to forecast net totex for cost sharing - WWN"},{"$f":" F$476","v":10.288650160917662},{"$f":" G$476","v":"£m"}]
[null,null,null,null,{"$f":" InpActive!E$273","v":"Outperformance Rate - WWN"},{"$f":" InpActive!F$273","v":0.41328584010084235},{"$f":" InpActive!G$273","v":"%"}]
[null,null,null,null,{"$f":" InpActive!E$274","v":"Underperformance Rate - WWN"},{"$f":" InpActive!F$274","v":0.58671415989915765},{"$f":" InpActive!G$274","v":"%"}]
[null,null,null,null,{"$f":"\"Active Sharing Rate - \"& INDEX(E481:E482,MATCH(F483,F481:F482,0))","v":"Active Sharing Rate - Underperformance Rate - WWN"},{"$f":"IF(F480<0,F481,F482)","v":0.58671415989915765},"%"]
[]
[null,null,null,null,{"$f":" E$476","v":"Total variance to forecast net totex for cost sharing - WWN"},{"$f":" F$476","v":10.288650160917662},{"$f":" G$476","v":"£m"}]
[null,null,null,null,{"$f":"E$483","v":"Active Sharing Rate - Underperformance Rate - WWN"},{"$f":"F$483","v":0.58671415989915765},{"$f":"G$483","v":"%"}]
[null,null,null,null,"Active adjustment for cost sharing - Net totex for cost sharing - WWN - Real",{"$f":" F485 * (1-F486)","v":4.2521534252585225},"£m"]
[]
[null,null,null,null,{"$f":" InpActive!E$137","v":"Ex ante allowance above Ofwat forecast  - Wastewater Network - Real"},{"$f":" InpActive!F$137","v":0},{"$f":" InpActive!G$137","v":"£m"}]
[null,null,null,null,{"$f":" E$447","v":"Totex profile - Cost Sharing - WWN"},0,"%",1,0,0,0.2153994336634916,0.20154121630520921,0.1992957663425266,0.19640769099179034,0.18735589269698227,0]
[null,null,null,null,"Ex ante allowance profiled - WWN - Real",null,"£m",{"$f":" SUM(J491:P491)","v":0},null,{"$f":" J490 * $F489","v":0},0,0,0,0,0,0]
[]
[null,null,null,null,{"$f":" E$491","v":"Ex ante allowance profiled - WWN - Real"},0,"£m",0,0,0,0,0,0,0,0,0]
[null,null,null,null,{"$f":"E$471","v":"Time value of money factor - WWN"},{"$f":"F$471","v":0},"Factor",0,0,1,1.122016155346969,1.0901828170879997,1.0592526399999997,1.0291999999999999,1,1]
[null,null,null,null,"Ex ante allowance profiled - WWN - Real - NPV adjusted",null,"£m",{"$f":" SUM(J495:P495)","v":0},null,{"$f":" J493 * J494","v":0},0,0,0,0,0,0]
[null,null,null,null,"NPV adjusted ex ante allowance - WWN - Real",{"$f":" H495","v":0},"£m"]
[]
[null,null,null,null,{"$f":"InpActive!E$144","v":"Actuals for CMA excluded items - WWN - nominal"},{"$f":"InpActive!F$144","v":0},{"$f":"InpActive!G$144","v":"£m"},{"$f":"InpActive!H$144","v":0},{"$f":"InpActive!I$144","v":0},{"$f":"InpActive!J$144","v":0},{"$f":"InpActive!K$144","v":0},{"$f":"InpActive!L$144","v":0},{"$f":"InpActive!M$144","v":0},{"$f":"InpActive!N$144","v":0},{"$f":"InpActive!O$144","v":0},{"$f":"InpActive!P$144","v":0}]
[null,null,null,null,{"$f":"Index!E$43","v":"CPI(H): Fin year average - inflate from base year 2017-18 average - CALC"},{"$f":"Index!F$43","v":0},{"$f":"Index!G$43","v":"%"},{"$f":"Index!H$43","v":0},{"$f":"Index!I$43","v":0},{"$f":"Index!J$43","v":1.0386214616983847},{"$f":"Index!K$43","v":1.0469374700143934},{"$f":"Index!L$43","v":1.0853990084759317},{"$f":"Index!M$43","v":1.1806332960179113},{"$f":"Index!N$43","v":1.2461218615064769},{"$f":"Index!O$43","v":1.2831440908363987},{"$f":"Index!P$43","v":1.3134495442187752}]
[null,null,null,null,"Actuals for CMA excluded items - WWN - real",null,"£m",null,null,{"$f":" J498 / J499","v":0},{"$f":" K498 / K499","v":0},{"$f":" L498 / L499","v":0},0,0,0,0]
[]
[null,null,null,null,{"$f":"InpActive!E$145","v":"Allowance for CMA excluded items - WWN - real"},{"$f":"InpActive!F$145","v":0},{"$f":"InpActive!G$145","v":"£m"},{"$f":"InpActive!H$145","v":0},{"$f":"InpActive!I$145","v":0},{"$f":"InpActive!J$145","v":0},{"$f":"InpActive!K$145","v":0},{"$f":"InpActive!L$145","v":0},{"$f":"InpActive!M$145","v":0},{"$f":"InpActive!N$145","v":0},{"$f":"InpActive!O$145","v":0},{"$f":"InpActive!P$145","v":0}]
[null,null,null,null,{"$f":"E500","v":"Actuals for CMA excluded items - WWN - real"},{"$f":"F500","v":0},"£m",0,0,0,{"$f":"K500","v":0},{"$f":"L500","v":0},0,0,0,0]
[null,null,null,null,"Variance to allowances for CMA excluded items - WWN",null,"£m",{"$f":" SUM(J504:P504)","v":0},null,{"$f":"J503-J502","v":0},{"$f":"K503-K502","v":0},{"$f":"L503-L502","v":0},0,0,0,0]
[]
[null,null,null,null,{"$f":" E$504","v":"Variance to allowances for CMA excluded items - WWN"},{"$f":" F$504","v":0},"£m",0,0,0,{"$f":" K$504","v":0},{"$f":" L$504","v":0},0,0,0,0]
[null,null,null,null,{"$f":"E$471","v":"Time value of money factor - WWN"},{"$f":"F$471","v":0},"Factor",0,0,1,1.122016155346969,1.0901828170879997,1.0592526399999997,1.0291999999999999,1,1]
[null,null,null,null,"Time value adjusted variance to allowances for CMA excluded items - WWN - real",null,"£m",{"$f":" SUM(J508:P508)","v":0},null,{"$f":" J506 * J507","v":0},{"$f":" K506 * K507","v":0},{"$f":" L506 * L507","v":0},0,0,0,0]
[null,null,null,null,"Total variance to allowances for CMA excluded items - WWN - real",{"$f":" $H508","v":0},"£m"]
[]
[null,null,null,null,{"$f":"E509","v":"Total variance to allowances for CMA excluded items - WWN - real"},{"$f":"F509","v":0},"£m"]
[null,null,null,null,{"$f":"InpActive!E146","v":"CMA excluded items sharing rate - WWN - real"},{"$f":"InpActive!F146","v":0},{"$f":"InpActive!G146","v":"%"}]
[null,null,null,null,"Allowable adjustment for CMA excluded items - WWN - Real",{"$f":"(F511* F512) * -1","v":0},"£m"]
[]
[null,null,null,null,{"$f":"E487","v":"Active adjustment for cost sharing - Net totex for cost sharing - WWN - Real"},{"$f":"F487","v":4.2521534252585225},{"$f":"G487","v":"£m"}]
[null,null,null,null,{"$f":" E$496","v":"NPV adjusted ex ante allowance - WWN - Real"},{"$f":" F$496","v":0},{"$f":" G$496","v":"£m"}]
[null,null,null,null,{"$f":"E425","v":"(Under)/Overfunded wage related totex at PR19 - WWN"},{"$f":"F425","v":7.8432697541942478},{"$f":"G425","v":"£m"}]
[null,null,null,null,{"$f":"E$513","v":"Allowable adjustment for CMA excluded items - WWN - Real"},{"$f":"F$513","v":0},"£m"]
[null,null,null,null,{"$f":"E$437","v":"Total Performance related pay recovery mechanism adjustment  - WWN - real"},{"$f":"F$437","v":0},"£m"]
[null,null,null,null,"Total adjustment for cost sharing after ex ante allowance - WWN - Real",{"$f":" F515 - SUM(F516:F518) + F519","v":-3.5911163289357253},"£m"]
[]
[null,null,"Wholesaler bad debt sharing adjustment"]
[]
[null,null,null,null,{"$f":" InpActive!E$140","v":"Business retail bad debt liability due to covid liquidity measures - WWN - real"},{"$f":" InpActive!F$140","v":0},{"$f":" InpActive!G$140","v":"£m"}]
[null,null,null,null,{"$f":"E$483","v":"Active Sharing Rate - Underperformance Rate - WWN"},{"$f":"F$483","v":0.58671415989915765},{"$f":"G$483","v":"%"}]
[null,null,null,null,"Embedded customer share - WWN",{"$f":" F524 * (1-F525)","v":0},"£m"]
[]
[null,null,null,null,{"$f":" InpActive!E$141","v":"Total Wholesaler Liability - WWN - real"},{"$f":" InpActive!F$141","v":0},{"$f":" InpActive!G$141","v":"£m"}]
[null,null,null,null,{"$f":"E$483","v":"Active Sharing Rate - Underperformance Rate - WWN"},{"$f":"F$483","v":0.58671415989915765},{"$f":"G$483","v":"%"}]
[null,null,null,null,"Wholesaler liability - WWN",{"$f":" F528 * (F529)","v":0},"£m"]
[]
[null,null,null,null,{"$f":" InpActive!E$140","v":"Business retail bad debt liability due to covid liquidity measures - WWN - real"},{"$f":" InpActive!F$140","v":0},{"$f":" InpActive!G$140","v":"£m"}]
[null,null,null,null,{"$f":" E$530","v":"Wholesaler liability - WWN"},{"$f":" F$530","v":0},{"$f":" G$530","v":"£m"}]
[null,null,null,null,"Customer Liability",{"$f":" F532 - F533","v":0},"£m"]
[]
[null,null,null,null,{"$f":" E534","v":"Customer Liability"},{"$f":" F534","v":0},"£m"]
[null,null,null,null,{"$f":"E526","v":"Embedded customer share - WWN"},{"$f":"F526","v":0},"£m"]
[null,null,null,null,"Wholesaler bad debt adjustment - WWN",{"$f":" IF(F536 > F537, F536 - F537, 0)","v":0},"£m"]
[]
[null,null,"Cost sharing adjustment RCV/Revenue Split"]
[]
[null,null,null,null,{"$f":" E$520","v":"Total adjustment for cost sharing after ex ante allowance - WWN - Real"},{"$f":" F$520","v":-3.5911163289357253},"£m"]
[null,null,null,null,{"$f":"InpActive!E$135","v":"Weighted average PAYG rate - WWN"},{"$f":"InpActive!F$135","v":0.40300000000000002},{"$f":"InpActive!G$135","v":"%"}]
[null,null,null,null,"Cost sharing revenue exc bad debt adjustment- WN - Real",{"$f":" F542 * $F$543","v":-1.4472198805610974},"£m"]
[]
[null,null,null,null,{"$f":"E$544","v":"Cost sharing revenue exc bad debt adjustment- WN - Real"},{"$f":"F$544","v":-1.4472198805610974},"£m"]
[null,null,null,null,{"$f":"E$538","v":"Wholesaler bad debt adjustment - WWN"},{"$f":"F$538","v":0},"£m"]
[null,null,null,null,"Cost sharing revenue adjustment - WWN - Real",{"$f":" SUM(F546:F547)","v":-1.4472198805610974},"£m"]
[]
[null,null,null,null,{"$f":" E$520","v":"Total adjustment for cost sharing after ex ante allowance - WWN - Real"},{"$f":" F$520","v":-3.5911163289357253},"£m"]
[null,null,null,null,{"$f":"InpActive!E$135","v":"Weighted average PAYG rate - WWN"},{"$f":"InpActive!F$135","v":0.40300000000000002},{"$f":"InpActive!G$135","v":"%"}]
[null,null,null,null,"Cost sharing RCV adjustment - WWN - Real",{"$f":" F550 * (1 - $F$551)","v":-2.1438964483746279},"£m"]
[]
[]
[]
[]
[]
[]
[]
[]
[]
[]
[]
[]
[]
[]
["END OF SHEET"]

{"sheet":"Abstraction & Rates","index":14,"n_rows":266,"n_cols":16,"rows_kept":266,"cut":false,"hidden":false,"merged":[]}
[{"$f":" RIGHT(CELL(\"filename\", $A$1), LEN(CELL(\"filename\", $A$1)) - SEARCH(\"]\", CELL(\"filename\", $A$1)))&\" Uncertainty Mechanism\"","v":{"$error":"#VALUE!"}}]
[null,null,null,null,{"$f":"Time!E$22","v":"Model Period BEG"},null,null,null,null,{"$f":"Time!J$22","v":"2019-04-01"},{"$f":"Time!K$22","v":"2020-04-01"},{"$f":"Time!L$22","v":"2021-04-01"},{"$f":"Time!M$22","v":"2022-04-01"},{"$f":"Time!N$22","v":"2023-04-01"},{"$f":"Time!O$22","v":"2024-04-01"},{"$f":"Time!P$22","v":"2025-04-01"}]
[null,null,null,null,{"$f":"Time!E$23","v":"Model Period END"},{"$f":"Check!F$8","v":0},"Error chks",null,null,{"$f":"Time!J$23","v":"2020-03-31"},{"$f":"Time!K$23","v":"2021-03-31"},{"$f":"Time!L$23","v":"2022-03-31"},{"$f":"Time!M$23","v":"2023-03-31"},{"$f":"Time!N$23","v":"2024-03-31"},{"$f":"Time!O$23","v":"2025-03-31"},{"$f":"Time!P$23","v":"2026-03-31"}]
[null,null,null,null,{"$f":"Time!E$59","v":"Pre Forecast vs Forecast"},null,null,null,null,{"$f":"Time!J$59","v":"Pre Fcst"},{"$f":"Time!K$59","v":"Forecast"},{"$f":"Time!L$59","v":"Forecast"},{"$f":"Time!M$59","v":"Forecast"},{"$f":"Time!N$59","v":"Forecast"},{"$f":"Time!O$59","v":"Forecast"},{"$f":"Time!P$59","v":"Post-Fcst"}]
[null,null,null,null,{"$f":"Time!E$101","v":"Financial Year Ending"},null,null,null,null,{"$f":"Time!J$101","v":2020},{"$f":"Time!K$101","v":2021},{"$f":"Time!L$101","v":2022},{"$f":"Time!M$101","v":2023},{"$f":"Time!N$101","v":2024},{"$f":"Time!O$101","v":2025},{"$f":"Time!P$101","v":2026}]
[null,null,null,null,{"$f":"Time!E$11","v":"Model column counter"},"Constant","Unit","Total",null,{"$f":"Time!J$11","v":1},{"$f":"Time!K$11","v":2},{"$f":"Time!L$11","v":3},{"$f":"Time!M$11","v":4},{"$f":"Time!N$11","v":5},{"$f":"Time!O$11","v":6},{"$f":"Time!P$11","v":7}]
[]
["WATER RESOURCES"]
[]
[null,null,"Uncertainty mechanism for business rates"]
[]
[null,null,null,"Profile total forecast business rates "]
[null,null,null,null,{"$f":"InpActive!E$49","v":"Business rates - Forecast - WR - Real"},{"$f":"InpActive!F$49","v":3.2810145914608184},{"$f":"InpActive!G$49","v":"£m"}]
[null,null,null,null,{"$f":"InpActive!E$38","v":"Business Rates  forecast profile - WR"},{"$f":"InpActive!F$38","v":0},{"$f":"InpActive!G$38","v":"%"},{"$f":"InpActive!H$38","v":0},{"$f":"InpActive!I$38","v":0},{"$f":"InpActive!J$38","v":0},{"$f":"InpActive!K$38","v":0.2},{"$f":"InpActive!L$38","v":0.2},{"$f":"InpActive!M$38","v":0.2},{"$f":"InpActive!N$38","v":0.2},{"$f":"InpActive!O$38","v":0.2},{"$f":"InpActive!P$38","v":0}]
[null,null,null,null,"Business rates - Forecast Profiled - WR - Real",null,"£m ",{"$f":" SUM(J15:P15)","v":3.2810145914608184},null,{"$f":" J14 * $F13","v":0},0.65620291829216371,0.65620291829216371,0.65620291829216371,0.65620291829216371,0.65620291829216371,0]
[]
[null,null,null,null,{"$f":" InpActive!E$52","v":"Business rates - Actual - WR - Nominal"},{"$f":" InpActive!F$52","v":0},{"$f":" InpActive!G$52","v":"£m"},{"$f":" InpActive!H$52","v":0},{"$f":" InpActive!I$52","v":0},{"$f":" InpActive!J$52","v":0},{"$f":" InpActive!K$52","v":0.96764071120538453},{"$f":" InpActive!L$52","v":0.96138774503593794},{"$f":" InpActive!M$52","v":0.97399999999999998},{"$f":" InpActive!N$52","v":0.621},{"$f":" InpActive!O$52","v":0.7513197185791628},{"$f":" InpActive!P$52","v":0}]
[null,null,null,null,{"$f":"Index!E$43","v":"CPI(H): Fin year average - inflate from base year 2017-18 average - CALC"},{"$f":"Index!F$43","v":0},{"$f":"Index!G$43","v":"%"},{"$f":"Index!H$43","v":0},{"$f":"Index!I$43","v":0},{"$f":"Index!J$43","v":1.0386214616983847},{"$f":"Index!K$43","v":1.0469374700143934},{"$f":"Index!L$43","v":1.0853990084759317},{"$f":"Index!M$43","v":1.1806332960179113},{"$f":"Index!N$43","v":1.2461218615064769},{"$f":"Index!O$43","v":1.2831440908363987},{"$f":"Index!P$43","v":1.3134495442187752}]
[null,null,null,null,"Business rates - Outturn - WR - Real",null,"£m",null,null,{"$f":" J17 / J18","v":0},{"$f":" K17 / K18","v":0.92425836205106049},{"$f":" L17 / L18","v":0.88574592157208176},0.82498096850660352,0.49834612422997948,0.58553027983741568,0]
[]
[null,null,null,"Variance to forecast business rates "]
[null,null,null,null,{"$f":" E$19","v":"Business rates - Outturn - WR - Real"},{"$f":" F$19","v":0},"£m",0,0,0,0.92425836205106049,0.88574592157208176,0.82498096850660352,0.49834612422997948,0.58553027983741568,0]
[null,null,null,null,{"$f":" E$15","v":"Business rates - Forecast Profiled - WR - Real"},0,"£m ",3.2810145914608184,0,0,0.65620291829216371,0.65620291829216371,0.65620291829216371,0.65620291829216371,0.65620291829216371,0]
[null,null,null,null,"Variance between forecast and outturn business rates - WR - Real",null,"£m",{"$f":" SUM(J24:P24)","v":0.4378470647363224},null,{"$f":" J22 - J23","v":0},0.26805544375889678,0.22954300327991806,0.16877805021443981,-0.15785679406218422,-7.0672638454748027E-2,0]
[]
[null,null,null,"Variance to forecast business rates  – Time adjusted"]
[null,null,null,null,{"$f":" E$24","v":"Variance between forecast and outturn business rates - WR - Real"},0,"£m",0.4378470647363224,0,0,0.26805544375889678,0.22954300327991806,0.16877805021443981,-0.15785679406218422,-7.0672638454748027E-2,0]
[null,null,null,null,{"$f":"'Cost sharing calculations'!E$137","v":"Time value of money factor - WR"},{"$f":"'Cost sharing calculations'!F$137","v":0},{"$f":"'Cost sharing calculations'!G$137","v":"Factor"},{"$f":"'Cost sharing calculations'!H$137","v":0},{"$f":"'Cost sharing calculations'!I$137","v":0},{"$f":"'Cost sharing calculations'!J$137","v":1},{"$f":"'Cost sharing calculations'!K$137","v":1.122016155346969},{"$f":"'Cost sharing calculations'!L$137","v":1.0901828170879997},{"$f":"'Cost sharing calculations'!M$137","v":1.0592526399999997},{"$f":"'Cost sharing calculations'!N$137","v":1.0291999999999999},{"$f":"'Cost sharing calculations'!O$137","v":1},{"$f":"'Cost sharing calculations'!P$137","v":1}]
[null,null,null,null,"Variance on business rates time value adjusted- WR - Real",null,"£m",{"$f":" SUM(J29:P29)","v":0.49664612074487391},null,{"$f":" J27 * J28","v":0},0.30076253842618306,0.25024383795854099,0.17877859526369788,-0.1624662124488,-7.0672638454748027E-2,0]
[null,null,null,null,"Adjustment for business rates - WR - Real",{"$f":" H$29","v":0.49664612074487391},"£m"]
[]
[null,null,null,"Under / Overperformance business rates"]
[null,null,null,null,{"$f":" InpActive!E$280","v":"Cost sharing rates Business rates - Overperformance"},{"$f":" InpActive!F$280","v":0.25},{"$f":" InpActive!G$280","v":"%"}]
[null,null,null,null,{"$f":"E$30","v":"Adjustment for business rates - WR - Real"},{"$f":"F$30","v":0.49664612074487391},{"$f":"G$30","v":"£m"}]
[null,null,null,null,"Business Rates Outperformance Adjustment - WR - Real",{"$f":" IF( F34 < 0, $F$34 *  (1 - F33), 0)","v":0},"£m"]
[]
[null,null,null,null,{"$f":" InpActive!E$281","v":"Cost sharing rates Business rates - Underperformance"},{"$f":" InpActive!F$281","v":0.25},{"$f":" InpActive!G$281","v":"%"}]
[null,null,null,null,{"$f":"E$30","v":"Adjustment for business rates - WR - Real"},{"$f":"F$30","v":0.49664612074487391},{"$f":"G$30","v":"£m"}]
[null,null,null,null,"Business Rates Underperformance Adjustment - WR - Real",{"$f":" IF( F38 > 0, $F$38 *  (1 - F37), 0)","v":0.37248459055865546},"£m"]
[]
[null,null,null,null,{"$f":"E$35","v":"Business Rates Outperformance Adjustment - WR - Real"},{"$f":"F$35","v":0},{"$f":"G$35","v":"£m"}]
[null,null,null,null,{"$f":"E$39","v":"Business Rates Underperformance Adjustment - WR - Real"},{"$f":"F$39","v":0.37248459055865546},{"$f":"G$39","v":"£m"}]
[null,null,null,null,"Active adjustment for business rates uncertainty mechanism - WR - Real",{"$f":" IF(F41 <> 0, F41, F42)","v":0.37248459055865546},"£m"]
[]
[null,null,"Uncertainty mechanism for abstraction charges"]
[]
[null,null,null,"Profile total forecast abstraction charges"]
[null,null,null,null,{"$f":"InpActive!E$50","v":"Abstraction charges - Forecast - WR - Real"},{"$f":"InpActive!F$50","v":11.222511023359866},{"$f":"InpActive!G$50","v":"£m"}]
[null,null,null,null,{"$f":"InpActive!E$39","v":"Abstraction Charges forecast profile - WR"},{"$f":"InpActive!F$39","v":0},{"$f":"InpActive!G$39","v":"%"},{"$f":"InpActive!H$39","v":0},{"$f":"InpActive!I$39","v":0},{"$f":"InpActive!J$39","v":0},{"$f":"InpActive!K$39","v":0.2},{"$f":"InpActive!L$39","v":0.2},{"$f":"InpActive!M$39","v":0.2},{"$f":"InpActive!N$39","v":0.2},{"$f":"InpActive!O$39","v":0.2},{"$f":"InpActive!P$39","v":0}]
[null,null,null,null,"Abstraction charges - Forecast Profiled - WR - Real",null,"£m ",{"$f":" SUM(J50:P50)","v":11.222511023359868},null,{"$f":" J49 * $F48","v":0},2.2445022046719734,2.2445022046719734,2.2445022046719734,2.2445022046719734,2.2445022046719734,0]
[]
[null,null,null,null,{"$f":" InpActive!E$53","v":"Abstraction charges - Actual - WR - Nominal"},{"$f":" InpActive!F$53","v":0},{"$f":" InpActive!G$53","v":"£m"},{"$f":" InpActive!H$53","v":0},{"$f":" InpActive!I$53","v":0},{"$f":" InpActive!J$53","v":0},{"$f":" InpActive!K$53","v":2.4794626375340818},{"$f":" InpActive!L$53","v":2.5835450156070361},{"$f":" InpActive!M$53","v":2.7320000000000002},{"$f":" InpActive!N$53","v":2.806},{"$f":" InpActive!O$53","v":3.0028447111317265},{"$f":" InpActive!P$53","v":0}]
[null,null,null,null,{"$f":"Index!E$43","v":"CPI(H): Fin year average - inflate from base year 2017-18 average - CALC"},{"$f":"Index!F$43","v":0},{"$f":"Index!G$43","v":"%"},{"$f":"Index!H$43","v":0},{"$f":"Index!I$43","v":0},{"$f":"Index!J$43","v":1.0386214616983847},{"$f":"Index!K$43","v":1.0469374700143934},{"$f":"Index!L$43","v":1.0853990084759317},{"$f":"Index!M$43","v":1.1806332960179113},{"$f":"Index!N$43","v":1.2461218615064769},{"$f":"Index!O$43","v":1.2831440908363987},{"$f":"Index!P$43","v":1.3134495442187752}]
[null,null,null,null,"Abstraction charges - Outturn - WR - Real",null,"£m",null,null,{"$f":" J52 / J53","v":0},{"$f":" K52 / K53","v":2.3683005991752246},{"$f":" L52 / L53","v":2.3802721353456304},2.3140123264476808,2.2517861909650927,2.3402240890766728,0]
[]
[null,null,null,"Variance to forecast abstraction charges"]
[null,null,null,null,{"$f":" E$54","v":"Abstraction charges - Outturn - WR - Real"},{"$f":" F$54","v":0},"£m",0,0,0,2.3683005991752246,2.3802721353456304,2.3140123264476808,2.2517861909650927,2.3402240890766728,0]
[null,null,null,null,{"$f":" E$50","v":"Abstraction charges - Forecast Profiled - WR - Real"},{"$f":" F$50","v":0},"£m ",11.222511023359868,0,0,2.2445022046719734,2.2445022046719734,2.2445022046719734,2.2445022046719734,2.2445022046719734,0]
[null,null,null,null,"Variance between forecast and outturn abstraction charges - WR - Real",null,"£m",{"$f":" SUM(J59:P59)","v":0.43208431765043454},null,{"$f":" J57 - J58","v":0},0.12379839450325125,0.13576993067365706,6.9510121775707479E-2,7.2839862931193267E-3,9.572188440469942E-2,0]
[]
[null,null,null,"Variance to forecast abstraction charges  – Time adjusted"]
[null,null,null,null,{"$f":" E$59","v":"Variance between forecast and outturn abstraction charges - WR - Real"},{"$f":" F$59","v":0},"£m",0.43208431765043454,0,0,0.12379839450325125,0.13576993067365706,6.9510121775707479E-2,7.2839862931193267E-3,9.572188440469942E-2,0]
[null,null,null,null,{"$f":"'Cost sharing calculations'!E$137","v":"Time value of money factor - WR"},{"$f":"'Cost sharing calculations'!F$137","v":0},{"$f":"'Cost sharing calculations'!G$137","v":"Factor"},{"$f":"'Cost sharing calculations'!H$137","v":0},{"$f":"'Cost sharing calculations'!I$137","v":0},{"$f":"'Cost sharing calculations'!J$137","v":1},{"$f":"'Cost sharing calculations'!K$137","v":1.122016155346969},{"$f":"'Cost sharing calculations'!L$137","v":1.0901828170879997},{"$f":"'Cost sharing calculations'!M$137","v":1.0592526399999997},{"$f":"'Cost sharing calculations'!N$137","v":1.0291999999999999},{"$f":"'Cost sharing calculations'!O$137","v":1},{"$f":"'Cost sharing calculations'!P$137","v":1}]
[null,null,null,null,"Variance on abstraction charges time value adjusted- WR - Real",null,"£m",{"$f":" SUM(J64:P64)","v":0.46376518723153259},null,{"$f":" J62 * J63","v":0},0.13890379863866531,0.14801404549764988,7.3628779997639615E-2,7.4966786928784106E-3,9.572188440469942E-2,0]
[null,null,null,null,"Adjustment for abstraction charges - WR - Real",{"$f":" H$64","v":0.46376518723153259},"£m"]
[]
[null,null,null,"Under / Overperformance abstraction charges"]
[null,null,null,null,{"$f":" InpActive!E$282","v":"Cost sharing rates Abstraction - Overperformance"},{"$f":" InpActive!F$282","v":0.25},{"$f":" InpActive!G$282","v":"%"}]
[null,null,null,null,{"$f":"E$65","v":"Adjustment for abstraction charges - WR - Real"},{"$f":"F$65","v":0.46376518723153259},"£m"]
[null,null,null,null,"Abstraction charges Outperformance Adjustment - WR - Real",{"$f":" IF( F69 < 0, F69 *  (1 - F68), 0)","v":0},"£m"]
[]
[null,null,null,null,{"$f":" InpActive!E$283","v":"Cost sharing rates Abstraction - Underperformance"},{"$f":" InpActive!F$283","v":0.25},{"$f":" InpActive!G$283","v":"%"}]
[null,null,null,null,{"$f":"E$65","v":"Adjustment for abstraction charges - WR - Real"},{"$f":"F$65","v":0.46376518723153259},"£m"]
[null,null,null,null,"Abstraction charges Underperformance Adjustment - WR - Real",{"$f":" IF( F73 > 0, F73 *  (1 - F72), 0)","v":0.34782389042364947},"£m"]
[]
[null,null,null,null,{"$f":"E$70","v":"Abstraction charges Outperformance Adjustment - WR - Real"},{"$f":"F$70","v":0},"£m"]
[null,null,null,null,{"$f":"E$74","v":"Abstraction charges Underperformance Adjustment - WR - Real"},{"$f":"F$74","v":0.34782389042364947},"£m"]
[null,null,null,null,"Active adjustment for abstraction charges uncertainty mechanism - WR - Real",{"$f":" IF(F76 <> 0, F76, F77)","v":0.34782389042364947},"£m"]
[]
[null,null,null,null,{"$f":"E43","v":"Active adjustment for business rates uncertainty mechanism - WR - Real"},{"$f":"F43","v":0.37248459055865546},"£m"]
[null,null,null,null,{"$f":"E78","v":"Active adjustment for abstraction charges uncertainty mechanism - WR - Real"},{"$f":"F78","v":0.34782389042364947},"£m"]
[null,null,null,null,"Active adjustment for abstraction charges & business rates uncertainty mechanism - WR - Real",{"$f":"SUM(F80:F81)","v":0.72030848098230493},"£m"]
[]
[null,null,null,null,{"$f":"E82","v":"Active adjustment for abstraction charges & business rates uncertainty mechanism - WR - Real"},{"$f":"F82","v":0.72030848098230493},"£m"]
[null,null,null,null,{"$f":"InpActive!E$55","v":"Weighted average PAYG rate - WR"},{"$f":"InpActive!F$55","v":0.64100000000000001},{"$f":"InpActive!G$55","v":"%"}]
[null,null,null,null,"Revenue adjustment business rates and abstraction - WR - Real",{"$f":" F84 * $F$85","v":0.46171773630965746},"£m"]
[]
[null,null,null,null,{"$f":" E$82","v":"Active adjustment for abstraction charges & business rates uncertainty mechanism - WR - Real"},{"$f":" F$82","v":0.72030848098230493},"£m"]
[null,null,null,null,{"$f":"InpActive!E$55","v":"Weighted average PAYG rate - WR"},{"$f":"InpActive!F$55","v":0.64100000000000001},{"$f":"InpActive!G$55","v":"%"}]
[null,null,null,null,"RCV adjustment business rates and abstraction - WR - Real",{"$f":" F88 * (1 - $F$89)","v":0.25859074467264748},"£m"]
[]
["WATER NETWORK"]
[]
[null,null,"Uncertainty mechanism for business rates"]
[]
[null,null,null,"Profile total forecast business rates"]
[null,null,null,null,{"$f":"InpActive!E$90","v":"Business rates - Forecast - WN  - Real"},{"$f":"InpActive!F$90","v":68.609227970398777},{"$f":"InpActive!G$90","v":"£m"}]
[null,null,null,null,{"$f":"InpActive!E$79","v":"Business Rates forecast profile - WN"},{"$f":"InpActive!F$79","v":0},{"$f":"InpActive!G$79","v":"%"},{"$f":"InpActive!H$79","v":0},{"$f":"InpActive!I$79","v":0},{"$f":"InpActive!J$79","v":0},{"$f":"InpActive!K$79","v":0.2},{"$f":"InpActive!L$79","v":0.2},{"$f":"InpActive!M$79","v":0.2},{"$f":"InpActive!N$79","v":0.2},{"$f":"InpActive!O$79","v":0.2},{"$f":"InpActive!P$79","v":0}]
[null,null,null,null,"Business rates - Forecast Profiled - WN - Real",null,"£m ",{"$f":" SUM(J99:P99)","v":68.609227970398777},null,{"$f":" J98 * $F97","v":0},13.721845594079756,13.721845594079756,13.721845594079756,13.721845594079756,13.721845594079756,0]
[]
[null,null,null,null,{"$f":" InpActive!E$93","v":"Business rates - Actual - WN - Nominal"},{"$f":" InpActive!F$93","v":0},{"$f":" InpActive!G$93","v":"£m"},{"$f":" InpActive!H$93","v":0},{"$f":" InpActive!I$93","v":0},{"$f":" InpActive!J$93","v":0},{"$f":" InpActive!K$93","v":15.051752578547637},{"$f":" InpActive!L$93","v":14.929807562819281},{"$f":" InpActive!M$93","v":14.994},{"$f":" InpActive!N$93","v":10.239000000000001},{"$f":" InpActive!O$93","v":11.562400220448565},{"$f":" InpActive!P$93","v":0}]
[null,null,null,null,{"$f":"Index!E$43","v":"CPI(H): Fin year average - inflate from base year 2017-18 average - CALC"},{"$f":"Index!F$43","v":0},{"$f":"Index!G$43","v":"%"},{"$f":"Index!H$43","v":0},{"$f":"Index!I$43","v":0},{"$f":"Index!J$43","v":1.0386214616983847},{"$f":"Index!K$43","v":1.0469374700143934},{"$f":"Index!L$43","v":1.0853990084759317},{"$f":"Index!M$43","v":1.1806332960179113},{"$f":"Index!N$43","v":1.2461218615064769},{"$f":"Index!O$43","v":1.2831440908363987},{"$f":"Index!P$43","v":1.3134495442187752}]
[null,null,null,null,"Business rates - Outturn - WN - Real",null,"£m",null,null,{"$f":" J101 / J102","v":0},{"$f":" K101 / K102","v":14.376935595151355},{"$f":" L101 / L102","v":13.755132855504486},{"$f":" M101 / M102","v":12.699963697934304},{"$f":" N101 / N102","v":8.2166923767967148},{"$f":" O101 / O102","v":9.0109912854072238},{"$f":" P101 / P102","v":0}]
[]
[null,null,null,"Variance to forecast business rates"]
[null,null,null,null,{"$f":" E$103","v":"Business rates - Outturn - WN - Real"},{"$f":" F$103","v":0},"£m",0,0,0,14.376935595151355,13.755132855504486,12.699963697934304,8.2166923767967148,9.0109912854072238,0]
[null,null,null,null,{"$f":" E$99","v":"Business rates - Forecast Profiled - WN - Real"},0,"£m ",68.609227970398777,0,0,13.721845594079756,13.721845594079756,13.721845594079756,13.721845594079756,13.721845594079756,0]
[null,null,null,null,"Variance between forecast and outturn business rates - WN - Real",null,"£m",{"$f":" SUM(J108:P108)","v":-10.549512159604696},null,{"$f":" J106 - J107","v":0},0.6550900010715992,3.3287261424730374E-2,-1.0218818961454517,-5.5051532172830413,-4.7108543086725323,0]
[]
[null,null,null,"Variance to forecast business rates – Time adjusted"]
[null,null,null,null,{"$f":" E$108","v":"Variance between forecast and outturn business rates - WN - Real"},0,"£m",-10.549512159604696,0,0,0.6550900010715992,3.3287261424730374E-2,-1.0218818961454517,-5.5051532172830413,-4.7108543086725323,0]
[null,null,null,null,{"$f":" 'Cost sharing calculations'!E$303","v":"Time value of money factor - WN"},{"$f":" 'Cost sharing calculations'!F$303","v":0},{"$f":" 'Cost sharing calculations'!G$303","v":"Factor"},{"$f":" 'Cost sharing calculations'!H$303","v":0},{"$f":" 'Cost sharing calculations'!I$303","v":0},{"$f":" 'Cost sharing calculations'!J$303","v":1},{"$f":" 'Cost sharing calculations'!K$303","v":1.122016155346969},{"$f":" 'Cost sharing calculations'!L$303","v":1.0901828170879997},{"$f":" 'Cost sharing calculations'!M$303","v":1.0592526399999997},{"$f":" 'Cost sharing calculations'!N$303","v":1.0291999999999999},{"$f":" 'Cost sharing calculations'!O$303","v":1},{"$f":" 'Cost sharing calculations'!P$303","v":1}]
[null,null,null,null,"Variance on business rates time value adjusted- WN - Real",null,"£m",{"$f":" SUM(J113:P113)","v":-10.687878331318757},null,{"$f":" J111 * J112","v":0},0.73502156440859756,3.6289200433157261E-2,-1.0824310962602752,-5.6659036912277054,-4.7108543086725323,0]
[null,null,null,null,"Adjustment for business rates for cost sharing - WN - Real",{"$f":" H$113","v":-10.687878331318757},"£m"]
[]
[null,null,null,"Under / Overperformance business rates"]
[null,null,null,null,{"$f":" InpActive!E$280","v":"Cost sharing rates Business rates - Overperformance"},{"$f":" InpActive!F$280","v":0.25},{"$f":" InpActive!G$280","v":"%"}]
[null,null,null,null,{"$f":"E$114","v":"Adjustment for business rates for cost sharing - WN - Real"},{"$f":"F$114","v":-10.687878331318757},{"$f":"G$114","v":"£m"}]
[null,null,null,null,"Business Rates Outperformance Adjustment - WN - Real",{"$f":" IF( F118 < 0, $F$118 *  (1 - F117), 0)","v":-8.0159087484890676},"£m"]
[]
[null,null,null,null,{"$f":" InpActive!E$281","v":"Cost sharing rates Business rates - Underperformance"},{"$f":" InpActive!F$281","v":0.25},{"$f":" InpActive!G$281","v":"%"}]
[null,null,null,null,{"$f":"E$114","v":"Adjustment for business rates for cost sharing - WN - Real"},{"$f":"F$114","v":-10.687878331318757},{"$f":"G$114","v":"£m"}]
[null,null,null,null,"Business Rates Underperformance Adjustment - WN - Real",{"$f":" IF( F122 > 0, $F$122 *  (1 -F121), 0)","v":0},"£m"]
[]
[null,null,null,null,{"$f":"E$119","v":"Business Rates Outperformance Adjustment - WN - Real"},{"$f":"F$119","v":-8.0159087484890676},{"$f":"G$119","v":"£m"}]
[null,null,null,null,{"$f":"E$123","v":"Business Rates Underperformance Adjustment - WN - Real"},{"$f":"F$123","v":0},{"$f":"G$123","v":"£m"}]
[null,null,null,null,"Active adjustment for business rates uncertainty mechanism - WN - Real",{"$f":" IF(F125 <> 0, F125, F126)","v":-8.0159087484890676},"£m"]
[]
[null,null,"Uncertainty mechanism for Abstraction charges"]
[]
[null,null,null,"Profile total forecast and abstraction charges"]
[null,null,null,null,{"$f":"InpActive!E$91","v":"Abstraction charges - Forecast - WN - Real"},{"$f":"InpActive!F$91","v":1.4761620238208066},{"$f":"InpActive!G$91","v":"£m"}]
[null,null,null,null,{"$f":"InpActive!E$80","v":"Abstraction Charges forecast profile - WN"},{"$f":"InpActive!F$80","v":0},{"$f":"InpActive!G$80","v":"%"},{"$f":"InpActive!H$80","v":0},{"$f":"InpActive!I$80","v":0},{"$f":"InpActive!J$80","v":0},{"$f":"InpActive!K$80","v":0.2},{"$f":"InpActive!L$80","v":0.2},{"$f":"InpActive!M$80","v":0.2},{"$f":"InpActive!N$80","v":0.2},{"$f":"InpActive!O$80","v":0.2},{"$f":"InpActive!P$80","v":0}]
[null,null,null,null,"Abstraction charges - Forecast Profiled - WN - Real",null,"£m ",{"$f":" SUM(J134:P134)","v":1.4761620238208066},null,{"$f":" J133 * $F132","v":0},0.29523240476416135,0.29523240476416135,0.29523240476416135,0.29523240476416135,0.29523240476416135,0]
[]
[null,null,null,null,{"$f":"InpActive!E94","v":"Abstraction charges - Actual - WN - Nominal"},{"$f":"InpActive!F94","v":0},{"$f":"InpActive!G94","v":"£m"},{"$f":"InpActive!H94","v":0},{"$f":"InpActive!I94","v":0},{"$f":"InpActive!J94","v":0},{"$f":"InpActive!K94","v":0.14249923032281106},{"$f":"InpActive!L94","v":0.14298974377236701},{"$f":"InpActive!M94","v":0.152},{"$f":"InpActive!N94","v":0.16},{"$f":"InpActive!O94","v":1.3083020360970177},{"$f":"InpActive!P94","v":0}]
[null,null,null,null,{"$f":"Index!E$43","v":"CPI(H): Fin year average - inflate from base year 2017-18 average - CALC"},{"$f":"Index!F$43","v":0},{"$f":"Index!G$43","v":"%"},{"$f":"Index!H$43","v":0},{"$f":"Index!I$43","v":0},{"$f":"Index!J$43","v":1.0386214616983847},{"$f":"Index!K$43","v":1.0469374700143934},{"$f":"Index!L$43","v":1.0853990084759317},{"$f":"Index!M$43","v":1.1806332960179113},{"$f":"Index!N$43","v":1.2461218615064769},{"$f":"Index!O$43","v":1.2831440908363987},{"$f":"Index!P$43","v":1.3134495442187752}]
[null,null,null,null,"Abstraction charges - Outturn - WN - Real",null,"£m",null,null,{"$f":" J136 / J137","v":0},{"$f":" K136 / K137","v":0.13611054566692696},{"$f":" L136 / L137","v":0.13173933517144698},0.12874446325770403,0.12839835728952773,1.0196064849148938,0]
[]
[null,null,null,"Variance to forecast abstraction charges"]
[null,null,null,null,{"$f":" E$138","v":"Abstraction charges - Outturn - WN - Real"},{"$f":" F$138","v":0},"£m",0,0,0,0.13611054566692696,0.13173933517144698,0.12874446325770403,0.12839835728952773,1.0196064849148938,0]
[null,null,null,null,{"$f":" E$134","v":"Abstraction charges - Forecast Profiled - WN - Real"},{"$f":" F$134","v":0},"£m ",1.4761620238208066,0,0,0.29523240476416135,0.29523240476416135,0.29523240476416135,0.29523240476416135,0.29523240476416135,0]
[null,null,null,null,"Variance between forecast and outturn abstraction charges - WR - Real",null,"£m",{"$f":" SUM(J143:P143)","v":6.8437162479692781E-2},null,{"$f":" J141 - J142","v":0},-0.15912185909723439,-0.16349306959271437,-0.16648794150645732,-0.16683404747463362,0.72437408015073246,0]
[]
[null,null,null,"Variance to forecast abstraction charges  – Time adjusted"]
[null,null,null,null,{"$f":" E$143","v":"Variance between forecast and outturn abstraction charges - WR - Real"},{"$f":" F$143","v":0},"£m",6.8437162479692781E-2,0,0,-0.15912185909723439,-0.16349306959271437,-0.16648794150645732,-0.16683404747463362,0.72437408015073246,0]
[null,null,null,null,{"$f":" 'Cost sharing calculations'!E$303","v":"Time value of money factor - WN"},{"$f":" 'Cost sharing calculations'!F$303","v":0},{"$f":" 'Cost sharing calculations'!G$303","v":"Factor"},{"$f":" 'Cost sharing calculations'!H$303","v":0},{"$f":" 'Cost sharing calculations'!I$303","v":0},{"$f":" 'Cost sharing calculations'!J$303","v":1},{"$f":" 'Cost sharing calculations'!K$303","v":1.122016155346969},{"$f":" 'Cost sharing calculations'!L$303","v":1.0901828170879997},{"$f":" 'Cost sharing calculations'!M$303","v":1.0592526399999997},{"$f":" 'Cost sharing calculations'!N$303","v":1.0291999999999999},{"$f":" 'Cost sharing calculations'!O$303","v":1},{"$f":" 'Cost sharing calculations'!P$303","v":1}]
[null,null,null,null,"Variance on abstraction charges time value adjusted- WN - Real",null,"£m",{"$f":" SUM(J148:P148)","v":1.9541055162068388E-2},null,{"$f":" J146 * J147","v":0},-0.17853729657594106,-0.17823733518294974,-0.17635279156888045,-0.17170560166089291,0.72437408015073246,0]
[null,null,null,null,"Adjustment for abstraction charges - WN - Real",{"$f":" H$148","v":1.9541055162068388E-2},"£m"]
[]
[null,null,null,"Under / Overperformance abstraction charges"]
[null,null,null,null,{"$f":" InpActive!E$282","v":"Cost sharing rates Abstraction - Overperformance"},{"$f":" InpActive!F$282","v":0.25},{"$f":" InpActive!G$282","v":"%"}]
[null,null,null,null,{"$f":"E$149","v":"Adjustment for abstraction charges - WN - Real"},{"$f":"F$149","v":1.9541055162068388E-2},"£m"]
[null,null,null,null,"Abstraction charges Outperformance Adjustment - WN - Real",{"$f":" IF( F153 < 0, $F$153 *  (1 - F152), 0)","v":0},"£m"]
[]
[null,null,null,null,{"$f":" InpActive!E$283","v":"Cost sharing rates Abstraction - Underperformance"},{"$f":" InpActive!F$283","v":0.25},{"$f":" InpActive!G$283","v":"%"}]
[null,null,null,null,{"$f":"E$149","v":"Adjustment for abstraction charges - WN - Real"},{"$f":"F$149","v":1.9541055162068388E-2},"£m"]
[null,null,null,null,"Abstraction charges Underperformance Adjustment - WN - Real",{"$f":" IF( F157 > 0, $F$157 *  (1 - F156), 0)","v":1.4655791371551291E-2},"£m"]
[]
[null,null,null,null,{"$f":"E$154","v":"Abstraction charges Outperformance Adjustment - WN - Real"},{"$f":"F$154","v":0},"£m"]
[null,null,null,null,{"$f":"E$158","v":"Abstraction charges Underperformance Adjustment - WN - Real"},{"$f":"F$158","v":1.4655791371551291E-2},"£m"]
[null,null,null,null,"Active adjustment for abstraction charges uncertainty mechanism - WN - Real",{"$f":" IF(F160 <> 0, F160, F161)","v":1.4655791371551291E-2},"£m"]
[]
[null,null,null,null,{"$f":"E127","v":"Active adjustment for business rates uncertainty mechanism - WN - Real"},{"$f":"F127","v":-8.0159087484890676},"£m"]
[null,null,null,null,{"$f":"E162","v":"Active adjustment for abstraction charges uncertainty mechanism - WN - Real"},{"$f":"F162","v":1.4655791371551291E-2},"£m"]
[null,null,null,null,"Active adjustment for abstraction charges & business rates uncertainty mechanism - WR - Real",{"$f":"SUM(F164:F165)","v":-8.0012529571175168},"£m"]
[]
[null,null,null,null,{"$f":" E$166","v":"Active adjustment for abstraction charges & business rates uncertainty mechanism - WR - Real"},{"$f":" F$166","v":-8.0012529571175168},"£m"]
[null,null,null,null,{"$f":"InpActive!E$96","v":"Weighted average PAYG rate - WN"},{"$f":"InpActive!F$96","v":0.72199999999999998},{"$f":"InpActive!G$96","v":"%"}]
[null,null,null,null,"Revenue adjustment business rates and abstraction - WN - Real",{"$f":" F168 * $F$169","v":-5.7769046350388473},"£m"]
[]
[null,null,null,null,{"$f":" E$166","v":"Active adjustment for abstraction charges & business rates uncertainty mechanism - WR - Real"},{"$f":" F$166","v":-8.0012529571175168},"£m"]
[null,null,null,null,{"$f":"InpActive!E$96","v":"Weighted average PAYG rate - WN"},{"$f":"InpActive!F$96","v":0.72199999999999998},{"$f":"InpActive!G$96","v":"%"}]
[null,null,null,null,"RCV adjustment business rates and abstraction - WN - Real",{"$f":" F172 * (1 - $F$173)","v":-2.2243483220786699},"£m"]
[]
["WASTEWATER NETWORK"]
[]
[null,null,"Uncertainty mechanism for business rates"]
[]
[null,null,null,"Profile total forecast business rates"]
[null,null,null,null,{"$f":"InpActive!E$131","v":"Business rates - Forecast - WWN - Real"},{"$f":"InpActive!F$131","v":34.793493596545602},{"$f":"InpActive!G$131","v":"£m"}]
[null,null,null,null,{"$f":"InpActive!E$121","v":"Business Rates forecast profile - WWN"},{"$f":"InpActive!F$121","v":0},{"$f":"InpActive!G$121","v":"%"},{"$f":"InpActive!H$121","v":0},{"$f":"InpActive!I$121","v":0},{"$f":"InpActive!J$121","v":0},{"$f":"InpActive!K$121","v":0.2},{"$f":"InpActive!L$121","v":0.2},{"$f":"InpActive!M$121","v":0.2},{"$f":"InpActive!N$121","v":0.2},{"$f":"InpActive!O$121","v":0.2},{"$f":"InpActive!P$121","v":0}]
[null,null,null,null,"Business rates - Forecast Profiled - WWN - Real",null,"£m ",{"$f":" SUM(J183:P183)","v":34.793493596545602},null,{"$f":" J182 * $F181","v":0},6.9586987193091208,6.9586987193091208,6.9586987193091208,6.9586987193091208,6.9586987193091208,0]
[]
[null,null,null,null,{"$f":" InpActive!E$133","v":"Business rates - Actual - WWN - Nominal"},{"$f":" InpActive!F$133","v":0},{"$f":" InpActive!G$133","v":"£m"},{"$f":" InpActive!H$133","v":0},{"$f":" InpActive!I$133","v":0},{"$f":" InpActive!J$133","v":0},{"$f":" InpActive!K$133","v":7.1502332510739732},{"$f":" InpActive!L$133","v":7.147619918277317},{"$f":" InpActive!M$133","v":7.1479999999999997},{"$f":" InpActive!N$133","v":8.1289999999999996},{"$f":" InpActive!O$133","v":10.255331064098332},{"$f":" InpActive!P$133","v":0}]
[null,null,null,null,{"$f":"Index!E$43","v":"CPI(H): Fin year average - inflate from base year 2017-18 average - CALC"},{"$f":"Index!F$43","v":0},{"$f":"Index!G$43","v":"%"},{"$f":"Index!H$43","v":0},{"$f":"Index!I$43","v":0},{"$f":"Index!J$43","v":1.0386214616983847},{"$f":"Index!K$43","v":1.0469374700143934},{"$f":"Index!L$43","v":1.0853990084759317},{"$f":"Index!M$43","v":1.1806332960179113},{"$f":"Index!N$43","v":1.2461218615064769},{"$f":"Index!O$43","v":1.2831440908363987},{"$f":"Index!P$43","v":1.3134495442187752}]
[null,null,null,null,"Business rates - Outturn - WWN - Real",null,"£m",null,null,{"$f":" J185 / J186","v":0},{"$f":" K185 / K186","v":6.8296660076324054},{"$f":" L185 / L186","v":6.5852464047426045},{"$f":" M185 / M186","v":6.0543777853030818},{"$f":" N185 / N186","v":6.523439040041068},{"$f":" O185 / O186","v":7.9923456276945055},{"$f":" P185 / P186","v":0}]
[]
[null,null,null,"Variance to forecast business rates"]
[null,null,null,null,{"$f":" E$187","v":"Business rates - Outturn - WWN - Real"},{"$f":" F$187","v":0},"£m",0,0,0,6.8296660076324054,6.5852464047426045,6.0543777853030818,6.523439040041068,7.9923456276945055,0]
[null,null,null,null,{"$f":" E$183","v":"Business rates - Forecast Profiled - WWN - Real"},{"$f":" F$183","v":0},"£m ",34.793493596545602,0,0,6.9586987193091208,6.9586987193091208,6.9586987193091208,6.9586987193091208,6.9586987193091208,0]
[null,null,null,null,"Variance between forecast and outturn business rates - WWN - Real",null,"£m",{"$f":" SUM(J192:P192)","v":-0.80841873113193863},null,{"$f":" J190 - J191","v":0},-0.12903271167671537,-0.37345231456651629,-0.90432093400603897,-0.43525967926805276,1.0336469083853848,0]
[]
[null,null,null,"Variance to forecast business rates - Time adjusted"]
[null,null,null,null,{"$f":" E$192","v":"Variance between forecast and outturn business rates - WWN - Real"},0,"£m",-0.80841873113193863,0,0,-0.12903271167671537,-0.37345231456651629,-0.90432093400603897,-0.43525967926805276,1.0336469083853848,0]
[null,null,null,null,{"$f":" 'Cost sharing calculations'!E$471","v":"Time value of money factor - WWN"},{"$f":" 'Cost sharing calculations'!F$471","v":0},{"$f":" 'Cost sharing calculations'!G$471","v":"Factor"},{"$f":" 'Cost sharing calculations'!H$471","v":0},{"$f":" 'Cost sharing calculations'!I$471","v":0},{"$f":" 'Cost sharing calculations'!J$471","v":1},{"$f":" 'Cost sharing calculations'!K$471","v":1.122016155346969},{"$f":" 'Cost sharing calculations'!L$471","v":1.0901828170879997},{"$f":" 'Cost sharing calculations'!M$471","v":1.0592526399999997},{"$f":" 'Cost sharing calculations'!N$471","v":1.0291999999999999},{"$f":" 'Cost sharing calculations'!O$471","v":1},{"$f":" 'Cost sharing calculations'!P$471","v":1}]
[null,null,null,null,"Variance on business rates  time value adjusted- WWN - Real",null,"£m",{"$f":" SUM(J197:P197)","v":-0.92413477368211816},null,{"$f":" J195 * J196","v":0},-0.14477678706950214,-0.40713129634215856,-0.95790433675316233,-0.44796926190267983,1.0336469083853848,0]
[null,null,null,null,"Adjustment for business rates for cost sharing - WWN - Real",{"$f":" H$197","v":-0.92413477368211816},"£m"]
[]
[null,null,null,"Under / Overperformance business rates "]
[null,null,null,null,{"$f":" InpActive!E$280","v":"Cost sharing rates Business rates - Overperformance"},{"$f":" InpActive!F$280","v":0.25},{"$f":" InpActive!G$280","v":"%"}]
[null,null,null,null,{"$f":"E$198","v":"Adjustment for business rates for cost sharing - WWN - Real"},{"$f":"F$198","v":-0.92413477368211816},{"$f":"G$198","v":"£m"}]
[null,null,null,null,"Business Rates Outperformance Adjustment - WWN - Real",{"$f":" IF( F202 < 0, $F$202 *  (1 - F201), 0)","v":-0.69310108026158868},"£m"]
[]
[null,null,null,null,{"$f":" InpActive!E$281","v":"Cost sharing rates Business rates - Underperformance"},{"$f":" InpActive!F$281","v":0.25},{"$f":" InpActive!G$281","v":"%"}]
[null,null,null,null,{"$f":"E$198","v":"Adjustment for business rates for cost sharing - WWN - Real"},{"$f":"F$198","v":-0.92413477368211816},{"$f":"G$198","v":"£m"}]
[null,null,null,null,"Business Rates Underperformance Adjustment - WWN - Real",{"$f":" IF( F206 > 0, $F$206 *  (1 - F205), 0)","v":0},"£m"]
[]
[null,null,null,null,{"$f":" E$203","v":"Business Rates Outperformance Adjustment - WWN - Real"},{"$f":" F$203","v":-0.69310108026158868},{"$f":" G$203","v":"£m"}]
[null,null,null,null,{"$f":" E$207","v":"Business Rates Underperformance Adjustment - WWN - Real"},{"$f":" F$207","v":0},{"$f":" G$207","v":"£m"}]
[null,null,null,null,"Active adjustment for business rates uncertainty mechanism - WWN - Real",{"$f":" IF(F209 <> 0, F209, F210)","v":-0.69310108026158868},"£m"]
[]
[null,null,null,null,{"$f":" E$211","v":"Active adjustment for business rates uncertainty mechanism - WWN - Real"},{"$f":" F$211","v":-0.69310108026158868},"£m"]
[null,null,null,null,{"$f":"InpActive!E$135","v":"Weighted average PAYG rate - WWN"},{"$f":"InpActive!F$135","v":0.40300000000000002},{"$f":"InpActive!G$135","v":"%"}]
[null,null,null,null,"Revenue adjustment business rates - WWN - Real",{"$f":" F213 * $F$214","v":-0.27931973534542026},"£m"]
[]
[null,null,null,null,{"$f":" E$211","v":"Active adjustment for business rates uncertainty mechanism - WWN - Real"},{"$f":" F$211","v":-0.69310108026158868},"£m"]
[null,null,null,null,{"$f":"InpActive!E$135","v":"Weighted average PAYG rate - WWN"},{"$f":"InpActive!F$135","v":0.40300000000000002},{"$f":"InpActive!G$135","v":"%"}]
[null,null,null,null,"RCV adjustment business rates - WWN - Real",{"$f":" F217 * (1 - $F$218)","v":-0.41378134491616841},"£m"]
[]
["BIORESOURCES"]
[]
[null,null,"Uncertainty mechanism for business rates"]
[]
[null,null,null,"Profile total forecast business rates "]
[null,null,null,null,{"$f":"InpActive!E$156","v":"Business rates - Forecast - BIO - Real"},{"$f":"InpActive!F$156","v":8.1630133197993793},{"$f":"InpActive!G$156","v":"£m"}]
[null,null,null,null,{"$f":"InpActive!E$160","v":"Business Rates forecast profile - BIO"},{"$f":"InpActive!F$160","v":0},{"$f":"InpActive!G$160","v":"%"},{"$f":"InpActive!H$160","v":0},{"$f":"InpActive!I$160","v":0},{"$f":"InpActive!J$160","v":0},{"$f":"InpActive!K$160","v":0.2},{"$f":"InpActive!L$160","v":0.2},{"$f":"InpActive!M$160","v":0.2},{"$f":"InpActive!N$160","v":0.2},{"$f":"InpActive!O$160","v":0.2},{"$f":"InpActive!P$160","v":0}]
[null,null,null,null,"Business rates - Forecast Profiled - BIO - Real",null,"£m ",{"$f":" SUM(J228:P228)","v":8.1630133197993793},null,{"$f":" J227 * $F226","v":0},1.6326026639598759,1.6326026639598759,1.6326026639598759,1.6326026639598759,1.6326026639598759,0]
[]
[null,null,null,null,{"$f":" InpActive!E$158","v":"Business rates - Actual - BIO - Nominal"},{"$f":" InpActive!F$158","v":0},{"$f":" InpActive!G$158","v":"£m"},{"$f":" InpActive!H$158","v":0},{"$f":" InpActive!I$158","v":0},{"$f":" InpActive!J$158","v":0},{"$f":" InpActive!K$158","v":1.646032582931648},{"$f":" InpActive!L$158","v":1.6186058685221594},{"$f":" InpActive!M$158","v":1.6140000000000001},{"$f":" InpActive!N$158","v":1.877},{"$f":" InpActive!O$158","v":2.1286888643629047},{"$f":" InpActive!P$158","v":0}]
[null,null,null,null,{"$f":"Index!E$43","v":"CPI(H): Fin year average - inflate from base year 2017-18 average - CALC"},{"$f":"Index!F$43","v":0},{"$f":"Index!G$43","v":"%"},{"$f":"Index!H$43","v":0},{"$f":"Index!I$43","v":0},{"$f":"Index!J$43","v":1.0386214616983847},{"$f":"Index!K$43","v":1.0469374700143934},{"$f":"Index!L$43","v":1.0853990084759317},{"$f":"Index!M$43","v":1.1806332960179113},{"$f":"Index!N$43","v":1.2461218615064769},{"$f":"Index!O$43","v":1.2831440908363987},{"$f":"Index!P$43","v":1.3134495442187752}]
[null,null,null,null,"Business rates  - Outturn - BIO - Real",null,"£m",null,null,{"$f":" J230 / J231","v":0},{"$f":" K230 / K231","v":1.5722358116660187},{"$f":" L230 / L231","v":1.4912542354308327},{"$f":" M230 / M231","v":1.3670629190653574},{"$f":" N230 / N231","v":1.506273228952772},{"$f":" O230 / O231","v":1.658963229122109},{"$f":" P230 / P231","v":0}]
[]
[null,null,null,"Variance to forecast business rates"]
[null,null,null,null,{"$f":" E$232","v":"Business rates  - Outturn - BIO - Real"},{"$f":" F$232","v":0},"£m",0,0,0,1.5722358116660187,1.4912542354308327,1.3670629190653574,1.506273228952772,1.658963229122109,0]
[null,null,null,null,{"$f":" E$228","v":"Business rates - Forecast Profiled - BIO - Real"},{"$f":" F$228","v":0},"£m ",8.1630133197993793,0,0,1.6326026639598759,1.6326026639598759,1.6326026639598759,1.6326026639598759,1.6326026639598759,0]
[null,null,null,null,"Variance between forecast and outturn business rates  - BIO - Real",null,"£m",{"$f":" SUM(J237:P237)","v":-0.56722389556228947},null,{"$f":" J235 - J236","v":0},-6.0366852293857187E-2,-0.14134842852904317,-0.26553974489451848,-0.12632943500710381,2.6360565162233174E-2,0]
[]
[null,null,null,"Variance to forecast business rates - Time adjusted"]
[null,null,null,null,{"$f":" E$237","v":"Variance between forecast and outturn business rates  - BIO - Real"},0,"£m",-0.56722389556228947,0,0,-6.0366852293857187E-2,-0.14134842852904317,-0.26553974489451848,-0.12632943500710381,2.6360565162233174E-2,0]
[null,null,null,null,{"$f":"Bioresources!E$49","v":"Time value of money factor - BIO"},{"$f":"Bioresources!F$49","v":0},{"$f":"Bioresources!G$49","v":"Factor"},{"$f":"Bioresources!H$49","v":0},{"$f":"Bioresources!I$49","v":0},{"$f":"Bioresources!J$49","v":1},{"$f":"Bioresources!K$49","v":1.122016155346969},{"$f":"Bioresources!L$49","v":1.0901828170879997},{"$f":"Bioresources!M$49","v":1.0592526399999997},{"$f":"Bioresources!N$49","v":1.0291999999999999},{"$f":"Bioresources!O$49","v":1},{"$f":"Bioresources!P$49","v":1}]
[null,null,null,null,"Variance on business rates time value adjusted- BIO - Real",null,"£m",{"$f":" SUM(J242:P242)","v":-0.6067595766774293},null,{"$f":" J240 * J241","v":0},-6.7732583521151996E-2,-0.15409562800475407,-0.28127367580444518,-0.13001825450931123,2.6360565162233174E-2,0]
[null,null,null,null,"Adjustment for business rates for cost sharing - BIO - Real",{"$f":" H$242","v":-0.6067595766774293},"£m"]
[]
[null,null,null,"Under / Overperformance business rates"]
[null,null,null,null,{"$f":" InpActive!E$280","v":"Cost sharing rates Business rates - Overperformance"},{"$f":" InpActive!F$280","v":0.25},{"$f":" InpActive!G$280","v":"%"}]
[null,null,null,null,{"$f":"E$243","v":"Adjustment for business rates for cost sharing - BIO - Real"},{"$f":"F$243","v":-0.6067595766774293},{"$f":"G$243","v":"£m"}]
[null,null,null,null,"Business Rates Outperformance Adjustment - BIO - Real",{"$f":" IF( F247 < 0, $F$247 *  (1 - F246), 0)","v":-0.455069682508072},"£m"]
[]
[null,null,null,null,{"$f":" InpActive!E$281","v":"Cost sharing rates Business rates - Underperformance"},{"$f":" InpActive!F$281","v":0.25},{"$f":" InpActive!G$281","v":"%"}]
[null,null,null,null,{"$f":"E$243","v":"Adjustment for business rates for cost sharing - BIO - Real"},{"$f":"F$243","v":-0.6067595766774293},{"$f":"G$243","v":"£m"}]
[null,null,null,null,"Business Rates Underperformance Adjustment - BIO - Real",{"$f":" IF( F251 > 0, $F$251 *  (1 - F250), 0)","v":0},"£m"]
[]
[null,null,null,null,{"$f":" E$248","v":"Business Rates Outperformance Adjustment - BIO - Real"},{"$f":" F$248","v":-0.455069682508072},"£m"]
[null,null,null,null,{"$f":" E$252","v":"Business Rates Underperformance Adjustment - BIO - Real"},{"$f":" F$252","v":0},"£m"]
[null,null,null,null,"Active adjustment for business rates uncertainty mechanism - BIO - Real",{"$f":" IF(F254 <> 0, F254, F255)","v":-0.455069682508072},"£m"]
[]
[null,null,null,null,{"$f":" E$256","v":"Active adjustment for business rates uncertainty mechanism - BIO - Real"},{"$f":" F$256","v":-0.455069682508072},"£m"]
[null,null,null,null,{"$f":"InpActive!E$162","v":"Weighted average PAYG rate - BIO"},{"$f":"InpActive!F$162","v":0.73},{"$f":"InpActive!G$162","v":"%"}]
[null,null,null,null,"Revenue adjustment business rates  - BIO - Real",{"$f":" F258 * $F$259","v":-0.33220086823089257},"£m"]
[]
[null,null,null,null,{"$f":" E$256","v":"Active adjustment for business rates uncertainty mechanism - BIO - Real"},{"$f":" F$256","v":-0.455069682508072},{"$f":" G$256","v":"£m"}]
[null,null,null,null,{"$f":"InpActive!E$162","v":"Weighted average PAYG rate - BIO"},{"$f":"InpActive!F$162","v":0.73},{"$f":"InpActive!G$162","v":"%"}]
[null,null,null,null,"RCV adjustment business rates - BIO - Real",{"$f":" F262 * (1 - $F$263)","v":-0.12286881427717945},"£m"]
[]
["END OF SHEET"]

{"sheet":"Bioresources","index":15,"n_rows":100,"n_cols":16,"rows_kept":100,"cut":false,"hidden":false,"merged":[]}
[{"$f":" RIGHT(CELL(\"filename\", $A$1), LEN(CELL(\"filename\", $A$1)) - SEARCH(\"]\", CELL(\"filename\", $A$1)))","v":{"$error":"#VALUE!"}}]
[null,null,null,null,{"$f":"Time!E$22","v":"Model Period BEG"},null,null,null,null,{"$f":"Time!J$22","v":"2019-04-01"},{"$f":"Time!K$22","v":"2020-04-01"},{"$f":"Time!L$22","v":"2021-04-01"},{"$f":"Time!M$22","v":"2022-04-01"},{"$f":"Time!N$22","v":"2023-04-01"},{"$f":"Time!O$22","v":"2024-04-01"},{"$f":"Time!P$22","v":"2025-04-01"}]
[null,null,null,null,{"$f":"Time!E$23","v":"Model Period END"},{"$f":"Check!F$8","v":0},"Error chks",null,null,{"$f":"Time!J$23","v":"2020-03-31"},{"$f":"Time!K$23","v":"2021-03-31"},{"$f":"Time!L$23","v":"2022-03-31"},{"$f":"Time!M$23","v":"2023-03-31"},{"$f":"Time!N$23","v":"2024-03-31"},{"$f":"Time!O$23","v":"2025-03-31"},{"$f":"Time!P$23","v":"2026-03-31"}]
[null,null,null,null,{"$f":"Time!E$59","v":"Pre Forecast vs Forecast"},null,null,null,null,{"$f":"Time!J$59","v":"Pre Fcst"},{"$f":"Time!K$59","v":"Forecast"},{"$f":"Time!L$59","v":"Forecast"},{"$f":"Time!M$59","v":"Forecast"},{"$f":"Time!N$59","v":"Forecast"},{"$f":"Time!O$59","v":"Forecast"},{"$f":"Time!P$59","v":"Post-Fcst"}]
[null,null,null,null,{"$f":"Time!E$101","v":"Financial Year Ending"},null,null,null,null,{"$f":"Time!J$101","v":2020},{"$f":"Time!K$101","v":2021},{"$f":"Time!L$101","v":2022},{"$f":"Time!M$101","v":2023},{"$f":"Time!N$101","v":2024},{"$f":"Time!O$101","v":2025},{"$f":"Time!P$101","v":2026}]
[null,null,null,null,{"$f":"Time!E$11","v":"Model column counter"},"Constant","Unit","Total",null,{"$f":"Time!J$11","v":1},{"$f":"Time!K$11","v":2},{"$f":"Time!L$11","v":3},{"$f":"Time!M$11","v":4},{"$f":"Time!N$11","v":5},{"$f":"Time!O$11","v":6},{"$f":"Time!P$11","v":7}]
[]
["BIORESOURCES"]
[]
[null,null,"Adjustment For Wage Growth"]
[]
[null,null,null,"Totex for wage adjustment"]
[null,null,null,null,{"$f":"InpActive!E$150","v":"Base Costs - BIO - Real"},{"$f":"InpActive!F$150","v":114.7},{"$f":"InpActive!G$150","v":"£m"}]
[null,null,null,null,{"$f":"InpActive!E$151","v":"WINEP / NEP ~ In-the-Round - BIO - Real"},{"$f":"InpActive!F$151","v":0},{"$f":"InpActive!G$151","v":"£m"}]
[null,null,null,null,"Totex available for wage indexation adjustment - BIO - Real",{"$f":" SUM(F13:F14)","v":114.7},"£m"]
[]
[null,null,null,"Profile for totex for wage adjustment"]
[null,null,null,null,{"$f":"InpActive!E$153","v":"Opex Split Profile - Base costs - BIO"},{"$f":"InpActive!F$153","v":0},{"$f":"InpActive!G$153","v":"%"},{"$f":"InpActive!H$153","v":0},{"$f":"InpActive!I$153","v":0},{"$f":"InpActive!J$153","v":0},{"$f":"InpActive!K$153","v":0.14557448148837213},{"$f":"InpActive!L$153","v":0.14625672704593445},{"$f":"InpActive!M$153","v":0.14694921226875687},{"$f":"InpActive!N$153","v":0.14765209283482697},{"$f":"InpActive!O$153","v":0.14797801216352618},{"$f":"InpActive!P$153","v":0}]
[null,null,null,null,{"$f":"InpActive!E$154","v":"Capex Split Profile - Base costs - BIO"},{"$f":"InpActive!F$154","v":0},{"$f":"InpActive!G$154","v":"%"},{"$f":"InpActive!H$154","v":0},{"$f":"InpActive!I$154","v":0},{"$f":"InpActive!J$154","v":0},{"$f":"InpActive!K$154","v":5.2590708679648983E-2},{"$f":"InpActive!L$154","v":4.5834751586344945E-2},{"$f":"InpActive!M$154","v":6.3555294781896726E-2},{"$f":"InpActive!N$154","v":4.4372806772711854E-2},{"$f":"InpActive!O$154","v":5.9235912377980968E-2},{"$f":"InpActive!P$154","v":0}]
[null,null,null,null,"Totex profile - BIO",null,"%",{"$f":" SUM(J20:P20)","v":1.0000000000000002},null,{"$f":" SUM(J18:J19)","v":0},0.19816519016802112,0.19209147863227941,0.2105045070506536,0.19202489960753882,0.20721392454150717,0]
[null,null,null,null,"Totex profile - 5 year percentage - BIO",{"$f":"H$20","v":1.0000000000000002},"%"]
[]
[null,null,null,null,{"$f":" E$21","v":"Totex profile - 5 year percentage - BIO"},{"$f":" F$21","v":1.0000000000000002},{"$f":" G$21","v":"%"}]
[null,null,null,null,"WWN Totex profile 100% check",{"$f":" IF(OR($F$23 = 1, F23 = 0), 0, 1)","v":0},"Check"]
[]
[null,null,null,null,{"$f":" E$15","v":"Totex available for wage indexation adjustment - BIO - Real"},{"$f":" F$15","v":114.7},{"$f":" G$15","v":"£m"}]
[null,null,null,null,{"$f":"Time!E$54","v":"Forecast Period Flag"},{"$f":"Time!F$54","v":0},{"$f":"Time!G$54","v":"flag"},{"$f":"Time!H$54","v":5},{"$f":"Time!I$54","v":0},{"$f":"Time!J$54","v":0},{"$f":"Time!K$54","v":1},{"$f":"Time!L$54","v":1},{"$f":"Time!M$54","v":1},{"$f":"Time!N$54","v":1},{"$f":"Time!O$54","v":1},{"$f":"Time!P$54","v":0}]
[null,null,null,null,{"$f":" E$20","v":"Totex profile - BIO"},0,"%",1.0000000000000002,0,0,0.19816519016802112,0.19209147863227941,0.2105045070506536,0.19202489960753882,0.20721392454150717,0]
[null,null,null,null,"Profiled Totex available for wage indexation adjustment - BIO - Real",null,"£m",{"$f":" SUM(J29:P29)","v":114.70000000000002},null,{"$f":" IF(J27 = 1, J28 * $F26, 0)","v":0},22.729547312272022,22.032892599122448,24.144866958709969,22.025255984984703,23.767437144910872,0]
[]
[null,null,null,"Totex applicable for wage adjustment by year"]
[null,null,null,null,{"$f":"InpActive!E$259","v":"Percentage totex linked to wage growth - BIO"},{"$f":"InpActive!F$259","v":0.38600000000000001},{"$f":"InpActive!G$259","v":"%"}]
[null,null,null,null,{"$f":"E29","v":"Profiled Totex available for wage indexation adjustment - BIO - Real"},0,"£m",114.70000000000002,0,0,22.729547312272022,22.032892599122448,24.144866958709969,22.025255984984703,23.767437144910872,0]
[null,null,null,null,"Profiled Net totex available for wage adj - BIO - Real",null,"£m",{"$f":" SUM(J34:P34)","v":44.2742},null,{"$f":" J33 * $F32","v":0},8.773605262537,8.5046965432612645,9.3199186460620478,8.501748810204095,9.1742307379355967,0]
[]
[null,null,null,"Adjustment factor for wage linked totex"]
[null,null,null,null,{"$f":"Time!E$54","v":"Forecast Period Flag"},{"$f":"Time!F$54","v":0},{"$f":"Time!G$54","v":"flag"},{"$f":"Time!H$54","v":5},{"$f":"Time!I$54","v":0},{"$f":"Time!J$54","v":0},{"$f":"Time!K$54","v":1},{"$f":"Time!L$54","v":1},{"$f":"Time!M$54","v":1},{"$f":"Time!N$54","v":1},{"$f":"Time!O$54","v":1},{"$f":"Time!P$54","v":0}]
[null,null,null,null,{"$f":" E$34","v":"Profiled Net totex available for wage adj - BIO - Real"},0,"£m",44.2742,0,0,8.773605262537,8.5046965432612645,9.3199186460620478,8.501748810204095,9.1742307379355967,0]
[null,null,null,null,{"$f":" 'Cost sharing calculations'!E$26","v":"Real adjustment factor for wages"},{"$f":" 'Cost sharing calculations'!F$26","v":0},{"$f":" 'Cost sharing calculations'!G$26","v":"%"},{"$f":" 'Cost sharing calculations'!H$26","v":0},{"$f":" 'Cost sharing calculations'!I$26","v":0},{"$f":" 'Cost sharing calculations'!J$26","v":0},{"$f":" 'Cost sharing calculations'!K$26","v":1.0088717366571422},{"$f":" 'Cost sharing calculations'!L$26","v":0.99546000675836432},{"$f":" 'Cost sharing calculations'!M$26","v":0.97709431475246755},{"$f":" 'Cost sharing calculations'!N$26","v":0.97400674149232291},{"$f":" 'Cost sharing calculations'!O$26","v":0.96778371236795124},{"$f":" 'Cost sharing calculations'!P$26","v":0}]
[null,null,null,null,"Profiled adjustment wage related totex - BIO - Real",null,"£m",{"$f":" SUM(J40:P40)","v":43.583398916707985},null,{"$f":" IF(J37 = 1, J38 * J39, 0)","v":0},8.8514423779599465,8.4660852784326952,9.1064395230227415,8.2807606556131237,8.8786710816794798,0]
[]
[null,null,null,"Variance to forecast wage linked totex "]
[null,null,null,null,{"$f":" E$40","v":"Profiled adjustment wage related totex - BIO - Real"},0,"£m",43.583398916707985,0,0,8.8514423779599465,8.4660852784326952,9.1064395230227415,8.2807606556131237,8.8786710816794798,0]
[null,null,null,null,{"$f":" E$34","v":"Profiled Net totex available for wage adj - BIO - Real"},0,"£m",44.2742,0,0,8.773605262537,8.5046965432612645,9.3199186460620478,8.501748810204095,9.1742307379355967,0]
[null,null,null,null,"Variance to forecast totex for wage adjustment- BIO",null,"£m",{"$f":" SUM(J45:P45)","v":-0.69080108329201728},null,{"$f":" J43 - J44","v":0},7.7837115422946468E-2,-3.8611264828569247E-2,-0.21347912303930627,-0.22098815459097132,-0.29555965625611691,0]
[]
[null,null,null,null,{"$f":" InpActive!E$288","v":"Financing cost index"},{"$f":" InpActive!F$288","v":0},{"$f":" InpActive!G$288","v":"Index"},{"$f":" InpActive!H$288","v":0},{"$f":" InpActive!I$288","v":0},{"$f":" InpActive!J$288","v":0},{"$f":" InpActive!K$288","v":4},{"$f":" InpActive!L$288","v":3},{"$f":" InpActive!M$288","v":2},{"$f":" InpActive!N$288","v":1},{"$f":" InpActive!O$288","v":0},{"$f":" InpActive!P$288","v":0}]
[null,null,null,null,{"$f":" InpActive!E$293","v":"Real WACC CPIH Deflated - BIO"},{"$f":" InpActive!F$293","v":2.92E-2},{"$f":" InpActive!G$293","v":"%"}]
[null,null,null,null,"Time value of money factor - BIO",null,"Factor",null,null,{"$f":"(1+$F48) ^ J47","v":1},1.122016155346969,1.0901828170879997,1.0592526399999997,1.0291999999999999,1,1]
[]
[null,null,null,"Wage totex overfunded/unfunded at PR19"]
[null,null,null,null,{"$f":" E$45","v":"Variance to forecast totex for wage adjustment- BIO"},0,"£m",-0.69080108329201728,0,0,7.7837115422946468E-2,-3.8611264828569247E-2,-0.21347912303930627,-0.22098815459097132,-0.29555965625611691,0]
[null,null,null,null,{"$f":"E49","v":"Time value of money factor - BIO"},0,"Factor",0,0,1,1.122016155346969,1.0901828170879997,1.0592526399999997,1.0291999999999999,1,1]
[null,null,null,null,"Variance to forecast totex for wage adjustment - NPV adjusted - BIO",null,"£m",{"$f":" SUM(J54:P54)","v":-0.70388782609740219},null,{"$f":" J52*J53","v":0},8.7334500990152664E-2,-4.2093337462140425E-2,-0.22612832466426994,-0.22744100870502765,-0.29555965625611691,0]
[null,null,null,null,"Total adjustment for wage related totex - BIO - Real",{"$f":" H54","v":-0.70388782609740219},"£m"]
[]
[]
[null,null,"Performance related pay recovery mechanism adjustment"]
[]
[null,null,null,null,{"$f":"InpActive!E$170","v":"Performance related pay recovery mechanism adjustment  - BIO - Nominal (Neg)"},{"$f":"InpActive!F$170","v":0},{"$f":"InpActive!G$170","v":"£m"},{"$f":"InpActive!H$170","v":0},{"$f":"InpActive!I$170","v":0},{"$f":"InpActive!J$170","v":0},{"$f":"InpActive!K$170","v":0},{"$f":"InpActive!L$170","v":0},{"$f":"InpActive!M$170","v":0},{"$f":"InpActive!N$170","v":0},{"$f":"InpActive!O$170","v":0},{"$f":"InpActive!P$170","v":0}]
[null,null,null,null,{"$f":"Index!E$43","v":"CPI(H): Fin year average - inflate from base year 2017-18 average - CALC"},{"$f":"Index!F$43","v":0},{"$f":"Index!G$43","v":"%"},{"$f":"Index!H$43","v":0},{"$f":"Index!I$43","v":0},{"$f":"Index!J$43","v":1.0386214616983847},{"$f":"Index!K$43","v":1.0469374700143934},{"$f":"Index!L$43","v":1.0853990084759317},{"$f":"Index!M$43","v":1.1806332960179113},{"$f":"Index!N$43","v":1.2461218615064769},{"$f":"Index!O$43","v":1.2831440908363987},{"$f":"Index!P$43","v":1.3134495442187752}]
[null,null,null,null,"Performance related pay recovery mechanism adjustment  - BIO - real",null,"£m",{"$f":"SUM(K62:O62)","v":0},null,{"$f":" J60 / J61","v":0},{"$f":" K60 / K61","v":0},{"$f":" L60 / L61","v":0},0,0,0,0]
[null,null,null,null,"Total Performance related pay recovery mechanism adjustment  - BIO - real",{"$f":"H62","v":0},"£m"]
[]
[null,null,"CMA exclusions"]
[]
[null,null,null,null,{"$f":"InpActive!E$165","v":"Actuals for CMA excluded items - BIO - nominal"},{"$f":"InpActive!F$165","v":0},{"$f":"InpActive!G$165","v":"£m"},{"$f":"InpActive!H$165","v":0},{"$f":"InpActive!I$165","v":0},{"$f":"InpActive!J$165","v":0},{"$f":"InpActive!K$165","v":0},{"$f":"InpActive!L$165","v":0},{"$f":"InpActive!M$165","v":0},{"$f":"InpActive!N$165","v":0},{"$f":"InpActive!O$165","v":0},{"$f":"InpActive!P$165","v":0}]
[null,null,null,null,{"$f":"Index!E$43","v":"CPI(H): Fin year average - inflate from base year 2017-18 average - CALC"},{"$f":"Index!F$43","v":0},{"$f":"Index!G$43","v":"%"},{"$f":"Index!H$43","v":0},{"$f":"Index!I$43","v":0},{"$f":"Index!J$43","v":1.0386214616983847},{"$f":"Index!K$43","v":1.0469374700143934},{"$f":"Index!L$43","v":1.0853990084759317},{"$f":"Index!M$43","v":1.1806332960179113},{"$f":"Index!N$43","v":1.2461218615064769},{"$f":"Index!O$43","v":1.2831440908363987},{"$f":"Index!P$43","v":1.3134495442187752}]
[null,null,null,null,"Actuals for CMA excluded items - BIO - real",null,"£m",null,null,{"$f":" J67 / J68","v":0},{"$f":" K67 / K68","v":0},{"$f":" L67 / L68","v":0},0,0,0,0]
[]
[null,null,null,null,{"$f":"InpActive!E$166","v":"Allowance for CMA excluded items - BIO - real"},{"$f":"InpActive!F$166","v":0},{"$f":"InpActive!G$166","v":"£m"},{"$f":"InpActive!H$166","v":0},{"$f":"InpActive!I$166","v":0},{"$f":"InpActive!J$166","v":0},{"$f":"InpActive!K$166","v":0},{"$f":"InpActive!L$166","v":0},{"$f":"InpActive!M$166","v":0},{"$f":"InpActive!N$166","v":0},{"$f":"InpActive!O$166","v":0},{"$f":"InpActive!P$166","v":0}]
[null,null,null,null,{"$f":"E69","v":"Actuals for CMA excluded items - BIO - real"},{"$f":"F69","v":0},"£m",0,0,0,{"$f":"K69","v":0},{"$f":"L69","v":0},0,0,0,0]
[null,null,null,null,"Variance to allowances for CMA excluded items - BIO",null,"£m",{"$f":" SUM(J73:P73)","v":0},null,{"$f":"J72-J71","v":0},{"$f":"K72-K71","v":0},{"$f":"L72-L71","v":0},0,0,0,0]
[]
[null,null,null,null,{"$f":"E$73","v":"Variance to allowances for CMA excluded items - BIO"},{"$f":"F$73","v":0},"£m",0,0,0,{"$f":"K$73","v":0},0,0,0,0,0]
[null,null,null,null,{"$f":"E$49","v":"Time value of money factor - BIO"},{"$f":"F$49","v":0},"Factor",0,0,1,1.122016155346969,1.0901828170879997,1.0592526399999997,1.0291999999999999,1,1]
[null,null,null,null,"Time value adjusted  variance to allowances for CMA excluded items - BIO - real",null,"£m",{"$f":" SUM(J77:P77)","v":0},null,{"$f":" J75 * J76","v":0},{"$f":" K75 * K76","v":0},0,0,0,0,0]
[null,null,null,null,"Total variance to allowances for CMA excluded items - BIO - real",{"$f":" $H77","v":0},"£m"]
[]
[null,null,null,null,{"$f":"E78","v":"Total variance to allowances for CMA excluded items - BIO - real"},{"$f":"F78","v":0},{"$f":"G78","v":"£m"}]
[null,null,null,null,{"$f":"InpActive!E167","v":"CMA excluded items sharing rate - BIO - real"},{"$f":"InpActive!F167","v":0},{"$f":"InpActive!G167","v":"%"}]
[null,null,null,null,"Allowable adjustment for CMA excluded items - BIO - Real",{"$f":"(F80* F81)","v":0},"£m"]
[]
[null,null,null,null,{"$f":"E55","v":"Total adjustment for wage related totex - BIO - Real"},{"$f":"F55","v":-0.70388782609740219},{"$f":"G55","v":"£m"}]
[null,null,null,null,{"$f":"E82","v":"Allowable adjustment for CMA excluded items - BIO - Real"},{"$f":"F82","v":0},"£m"]
[null,null,null,null,{"$f":"E63","v":"Total Performance related pay recovery mechanism adjustment  - BIO - real"},0,"£m"]
[null,null,null,null,"Total adjustment for cost sharing - BIO - Real",{"$f":" SUM(F84:F85) + F86","v":-0.70388782609740219},"£m"]
[]
[null,null,null,null,{"$f":"E87","v":"Total adjustment for cost sharing - BIO - Real"},{"$f":"F87","v":-0.70388782609740219},"£m"]
[null,null,null,null,{"$f":"InpActive!E162","v":"Weighted average PAYG rate - BIO"},{"$f":"InpActive!F162","v":0.73},{"$f":"InpActive!G162","v":"%"}]
[null,null,null,null,"Cost sharing Revenue adjustment - BIO - Real",{"$f":" F90 * F89","v":-0.51383811305110361},"£m"]
[]
[null,null,null,null,{"$f":"E87","v":"Total adjustment for cost sharing - BIO - Real"},{"$f":"F87","v":-0.70388782609740219},{"$f":"G87","v":"£m"}]
[null,null,null,null,{"$f":"InpActive!E162","v":"Weighted average PAYG rate - BIO"},{"$f":"InpActive!F162","v":0.73},{"$f":"InpActive!G162","v":"%"}]
[null,null,null,null,"Cost sharing RCV adjustment - BIO - Real",{"$f":" F93 * (1 - F94)","v":-0.19004971304629861},"£m"]
[]
[]
[]
[]
["END OF SHEET"]

{"sheet":"Thames Tideway Tunnel","index":16,"n_rows":127,"n_cols":16,"rows_kept":127,"cut":false,"hidden":false,"merged":[]}
[{"$f":" RIGHT(CELL(\"filename\", $A$1), LEN(CELL(\"filename\", $A$1)) - SEARCH(\"]\", CELL(\"filename\", $A$1)))","v":{"$error":"#VALUE!"}}]
[null,null,null,null,{"$f":"Time!E$22","v":"Model Period BEG"},null,null,null,null,{"$f":"Time!J$22","v":"2019-04-01"},{"$f":"Time!K$22","v":"2020-04-01"},{"$f":"Time!L$22","v":"2021-04-01"},{"$f":"Time!M$22","v":"2022-04-01"},{"$f":"Time!N$22","v":"2023-04-01"},{"$f":"Time!O$22","v":"2024-04-01"},{"$f":"Time!P$22","v":"2025-04-01"}]
[null,null,null,null,{"$f":"Time!E$23","v":"Model Period END"},{"$f":"Check!F$8","v":0},"Error chks",null,null,{"$f":"Time!J$23","v":"2020-03-31"},{"$f":"Time!K$23","v":"2021-03-31"},{"$f":"Time!L$23","v":"2022-03-31"},{"$f":"Time!M$23","v":"2023-03-31"},{"$f":"Time!N$23","v":"2024-03-31"},{"$f":"Time!O$23","v":"2025-03-31"},{"$f":"Time!P$23","v":"2026-03-31"}]
[null,null,null,null,{"$f":"Time!E$59","v":"Pre Forecast vs Forecast"},null,null,null,null,{"$f":"Time!J$59","v":"Pre Fcst"},{"$f":"Time!K$59","v":"Forecast"},{"$f":"Time!L$59","v":"Forecast"},{"$f":"Time!M$59","v":"Forecast"},{"$f":"Time!N$59","v":"Forecast"},{"$f":"Time!O$59","v":"Forecast"},{"$f":"Time!P$59","v":"Post-Fcst"}]
[null,null,null,null,{"$f":"Time!E$101","v":"Financial Year Ending"},null,null,null,null,{"$f":"Time!J$101","v":2020},{"$f":"Time!K$101","v":2021},{"$f":"Time!L$101","v":2022},{"$f":"Time!M$101","v":2023},{"$f":"Time!N$101","v":2024},{"$f":"Time!O$101","v":2025},{"$f":"Time!P$101","v":2026}]
[null,null,null,null,{"$f":"Time!E$11","v":"Model column counter"},"Constant","Unit","Total",null,{"$f":"Time!J$11","v":1},{"$f":"Time!K$11","v":2},{"$f":"Time!L$11","v":3},{"$f":"Time!M$11","v":4},{"$f":"Time!N$11","v":5},{"$f":"Time!O$11","v":6},{"$f":"Time!P$11","v":7}]
[]
["THAMES TIDEWAY TUNNEL"]
[]
[null,null,"Adjustment For Wage Growth"]
[]
[null,null,null,"Profile for totex for wage adjustment"]
[null,null,null,null,{"$f":"InpActive!E$177","v":"Opex Split Profile - Base costs - TTT"},{"$f":"InpActive!F$177","v":0},{"$f":"InpActive!G$177","v":"%"},{"$f":"InpActive!H$177","v":0},{"$f":"InpActive!I$177","v":0},{"$f":"InpActive!J$177","v":0},{"$f":"InpActive!K$177","v":0},{"$f":"InpActive!L$177","v":0},{"$f":"InpActive!M$177","v":0},{"$f":"InpActive!N$177","v":0},{"$f":"InpActive!O$177","v":0},{"$f":"InpActive!P$177","v":0}]
[null,null,null,null,{"$f":"InpActive!E$178","v":"Capex Split Profile - Base costs - TTT"},{"$f":"InpActive!F$178","v":0},{"$f":"InpActive!G$178","v":"%"},{"$f":"InpActive!H$178","v":0},{"$f":"InpActive!I$178","v":0},{"$f":"InpActive!J$178","v":0},{"$f":"InpActive!K$178","v":0},{"$f":"InpActive!L$178","v":0},{"$f":"InpActive!M$178","v":0},{"$f":"InpActive!N$178","v":0},{"$f":"InpActive!O$178","v":0},{"$f":"InpActive!P$178","v":0}]
[null,null,null,null,"Totex profile - TTT",null,"%",{"$f":" SUM(J15:P15)","v":0},null,{"$f":" SUM(J13:J14)","v":0},0,0,0,0,0,0]
[null,null,null,null,"Totex profile - 5 year percentage - TTT",{"$f":"H15","v":0},"%"]
[]
[null,null,null,null,{"$f":" E$16","v":"Totex profile - 5 year percentage - TTT"},{"$f":" F$16","v":0},{"$f":" G$16","v":"%"}]
[null,null,null,null,"TTT Totex profile 100% check",{"$f":" IF(OR($F$18 = 1, F18 = 0), 0, 1)","v":0},"Check"]
[]
[null,null,null,null,{"$f":"InpActive!E$175","v":"Base Costs - TTT - Real"},{"$f":"InpActive!F$175","v":0},{"$f":"InpActive!G$175","v":"£m"}]
[null,null,null,null,{"$f":"Time!E$54","v":"Forecast Period Flag"},{"$f":"Time!F$54","v":0},{"$f":"Time!G$54","v":"flag"},{"$f":"Time!H$54","v":5},{"$f":"Time!I$54","v":0},{"$f":"Time!J$54","v":0},{"$f":"Time!K$54","v":1},{"$f":"Time!L$54","v":1},{"$f":"Time!M$54","v":1},{"$f":"Time!N$54","v":1},{"$f":"Time!O$54","v":1},{"$f":"Time!P$54","v":0}]
[null,null,null,null,{"$f":" E$15","v":"Totex profile - TTT"},0,"%",0,0,0,0,0,0,0,0,0]
[null,null,null,null,"Profiled Totex available for wage indexation adjustment - TTT - Real",null,"£m",{"$f":" SUM(J24:P24)","v":0},null,{"$f":" IF(J22 = 1, J23 * $F21, 0)","v":0},0,0,0,0,0,0]
[]
[null,null,null,"Totex applicable for wage adjustment by year"]
[null,null,null,null,{"$f":"InpActive!E261","v":"Percentage totex linked to wage growth - TTT"},{"$f":"InpActive!F261","v":0.38600000000000001},{"$f":"InpActive!G261","v":"%"}]
[null,null,null,null,{"$f":"E24","v":"Profiled Totex available for wage indexation adjustment - TTT - Real"},0,"£m",0,0,0,0,0,0,0,0,0]
[null,null,null,null,"Profiled Net totex available for wage adj - TTT - Real",null,"£m",{"$f":" SUM(J29:P29)","v":0},null,{"$f":" J28 * $F27","v":0},0,0,0,0,0,0]
[]
[null,null,null,"Adjustment factor for wage linked totex"]
[null,null,null,null,{"$f":"Time!E$54","v":"Forecast Period Flag"},{"$f":"Time!F$54","v":0},{"$f":"Time!G$54","v":"flag"},{"$f":"Time!H$54","v":5},{"$f":"Time!I$54","v":0},{"$f":"Time!J$54","v":0},{"$f":"Time!K$54","v":1},{"$f":"Time!L$54","v":1},{"$f":"Time!M$54","v":1},{"$f":"Time!N$54","v":1},{"$f":"Time!O$54","v":1},{"$f":"Time!P$54","v":0}]
[null,null,null,null,{"$f":" E$29","v":"Profiled Net totex available for wage adj - TTT - Real"},0,"£m",0,0,0,0,0,0,0,0,0]
[null,null,null,null,{"$f":"'Cost sharing calculations'!E26","v":"Real adjustment factor for wages"},{"$f":"'Cost sharing calculations'!F26","v":0},{"$f":"'Cost sharing calculations'!G26","v":"%"},{"$f":"'Cost sharing calculations'!H26","v":0},{"$f":"'Cost sharing calculations'!I26","v":0},{"$f":"'Cost sharing calculations'!J26","v":0},{"$f":"'Cost sharing calculations'!K26","v":1.0088717366571422},{"$f":"'Cost sharing calculations'!L26","v":0.99546000675836432},{"$f":"'Cost sharing calculations'!M26","v":0.97709431475246755},{"$f":"'Cost sharing calculations'!N26","v":0.97400674149232291},{"$f":"'Cost sharing calculations'!O26","v":0.96778371236795124},{"$f":"'Cost sharing calculations'!P26","v":0}]
[null,null,null,null,"Profiled adjustment wage related totex - TTT - Real",null,"£m",{"$f":" SUM(J35:P35)","v":0},null,{"$f":" IF(J32 = 1, J33 * J34, 0)","v":0},0,0,0,0,0,0]
[]
[null,null,null,"Variance to forecast wage linked totex "]
[null,null,null,null,{"$f":" E$35","v":"Profiled adjustment wage related totex - TTT - Real"},0,"£m",0,0,0,0,0,0,0,0,0]
[null,null,null,null,{"$f":" E$29","v":"Profiled Net totex available for wage adj - TTT - Real"},0,"£m",0,0,0,0,0,0,0,0,0]
[null,null,null,null,"Variance to forecast totex for wage adjustment - TTT",null,"£m",{"$f":" SUM(J40:P40)","v":0},null,{"$f":" J38 - J39","v":0},0,0,0,0,0,0]
[]
[null,null,null,"Wage totex overfunded/unfunded at PR19"]
[]
[null,null,null,null,{"$f":"InpActive!E288","v":"Financing cost index"},{"$f":"InpActive!F288","v":0},{"$f":"InpActive!G288","v":"Index"},{"$f":"InpActive!H288","v":0},{"$f":"InpActive!I288","v":0},{"$f":"InpActive!J288","v":0},{"$f":"InpActive!K288","v":4},{"$f":"InpActive!L288","v":3},{"$f":"InpActive!M288","v":2},{"$f":"InpActive!N288","v":1},{"$f":"InpActive!O288","v":0},{"$f":"InpActive!P288","v":0}]
[null,null,null,null,{"$f":"InpActive!E294","v":"Real WACC CPIH Deflated - TTT"},{"$f":"InpActive!F294","v":0},{"$f":"InpActive!G294","v":"%"}]
[null,null,null,null,"Time value of money factor - TTT",null,"Factor",null,null,{"$f":"(1+$F45) ^ J44","v":1},1,1,1,1,1,1]
[]
[null,null,null,null,{"$f":" E$40","v":"Variance to forecast totex for wage adjustment - TTT"},0,"£m",0,0,0,0,0,0,0,0,0]
[null,null,null,null,{"$f":"E46","v":"Time value of money factor - TTT"},0,"Factor",0,0,1,1,1,1,1,1,1]
[null,null,null,null,"Variance to forecast totex for wage adjustment - NPV adjusted - WWN",null,"£m",{"$f":" SUM(J50:P50)","v":0},null,{"$f":" J48*J49","v":0},0,0,0,0,0,0]
[null,null,null,null,"(Under)/Overfunded wage related totex at PR19 - TTT",{"$f":" H50 * -1","v":0},"£m"]
[]
[null,null,"Cost sharing on net totex available for reconciliation"]
[]
[null,null,null,null,{"$f":"InpActive!E$184","v":"Net totex for cost sharing reconciliation - TTT - nominal"},{"$f":"InpActive!F$184","v":0},{"$f":"InpActive!G$184","v":"£m"},{"$f":"InpActive!H$184","v":0},{"$f":"InpActive!I$184","v":0},{"$f":"InpActive!J$184","v":0},{"$f":"InpActive!K$184","v":0},{"$f":"InpActive!L$184","v":0},{"$f":"InpActive!M$184","v":0},{"$f":"InpActive!N$184","v":0},{"$f":"InpActive!O$184","v":0},{"$f":"InpActive!P$184","v":0}]
[null,null,null,null,{"$f":"Index!E$43","v":"CPI(H): Fin year average - inflate from base year 2017-18 average - CALC"},{"$f":"Index!F$43","v":0},{"$f":"Index!G$43","v":"%"},{"$f":"Index!H$43","v":0},{"$f":"Index!I$43","v":0},{"$f":"Index!J$43","v":1.0386214616983847},{"$f":"Index!K$43","v":1.0469374700143934},{"$f":"Index!L$43","v":1.0853990084759317},{"$f":"Index!M$43","v":1.1806332960179113},{"$f":"Index!N$43","v":1.2461218615064769},{"$f":"Index!O$43","v":1.2831440908363987},{"$f":"Index!P$43","v":1.3134495442187752}]
[null,null,null,null,"Actual net totex for cost sharing reconciliation - TTT - Real",null,"£m",null,null,{"$f":" J55 / J56","v":0},0,0,0,0,0,0]
[]
[null,null,null,null,{"$f":"InpActive!E$186","v":"Performance related pay recovery mechanism adjustment  - TTT - Nominal (Neg)"},{"$f":"InpActive!F$186","v":0},{"$f":"InpActive!G$186","v":"£m"},{"$f":"InpActive!H$186","v":0},{"$f":"InpActive!I$186","v":0},{"$f":"InpActive!J$186","v":0},{"$f":"InpActive!K$186","v":0},{"$f":"InpActive!L$186","v":0},{"$f":"InpActive!M$186","v":0},{"$f":"InpActive!N$186","v":0},{"$f":"InpActive!O$186","v":0},{"$f":"InpActive!P$186","v":0}]
[null,null,null,null,{"$f":"Index!E$43","v":"CPI(H): Fin year average - inflate from base year 2017-18 average - CALC"},{"$f":"Index!F$43","v":0},{"$f":"Index!G$43","v":"%"},{"$f":"Index!H$43","v":0},{"$f":"Index!I$43","v":0},{"$f":"Index!J$43","v":1.0386214616983847},{"$f":"Index!K$43","v":1.0469374700143934},{"$f":"Index!L$43","v":1.0853990084759317},{"$f":"Index!M$43","v":1.1806332960179113},{"$f":"Index!N$43","v":1.2461218615064769},{"$f":"Index!O$43","v":1.2831440908363987},{"$f":"Index!P$43","v":1.3134495442187752}]
[null,null,null,null,"Performance related pay recovery mechanism adjustment  - TTT - real",null,"£m",{"$f":"SUM(K61:O61)","v":0},null,{"$f":" J59 / J60","v":0},{"$f":" K59 / K60","v":0},{"$f":" L59 / L60","v":0},0,0,0,0]
[null,null,null,null,"Total Performance related pay recovery mechanism adjustment  - TTT - real",{"$f":"H61","v":0},"£m"]
[]
[null,null,null,null,{"$f":"E$57","v":"Actual net totex for cost sharing reconciliation - TTT - Real"},0,"£m",0,0,0,0,0,0,0,0,0]
[null,null,null,null,{"$f":"E61","v":"Performance related pay recovery mechanism adjustment  - TTT - real"},0,"£m",0,0,0,0,0,0,0,0,0]
[null,null,null,null,{"$f":"Time!E$54","v":"Forecast Period Flag"},{"$f":"Time!F$54","v":0},{"$f":"Time!G$54","v":"flag"},{"$f":"Time!H$54","v":5},{"$f":"Time!I$54","v":0},{"$f":"Time!J$54","v":0},{"$f":"Time!K$54","v":1},{"$f":"Time!L$54","v":1},{"$f":"Time!M$54","v":1},{"$f":"Time!N$54","v":1},{"$f":"Time!O$54","v":1},{"$f":"Time!P$54","v":0}]
[null,null,null,null,"Actual net totex for cost sharing reconciliation - TTT - Real",null,"£m",{"$f":" SUM(J67:P67)","v":0},null,{"$f":" (J64 + J65) * J66","v":0},{"$f":" (K64 + K65) * K66","v":0},0,0,0,0,0]
[]
[null,null,null,"Profile for net totex for cost sharing"]
[null,null,null,null,{"$f":"InpActive!E180","v":"Opex split profile - Cost sharing - TTT"},{"$f":"InpActive!F180","v":0},{"$f":"InpActive!G180","v":"%"},{"$f":"InpActive!H180","v":0},{"$f":"InpActive!I180","v":0},{"$f":"InpActive!J180","v":0},{"$f":"InpActive!K180","v":0},{"$f":"InpActive!L180","v":0},{"$f":"InpActive!M180","v":0},{"$f":"InpActive!N180","v":0},{"$f":"InpActive!O180","v":0},{"$f":"InpActive!P180","v":0}]
[null,null,null,null,{"$f":"InpActive!E181","v":"Capex split profile - Cost sharing - TTT"},{"$f":"InpActive!F181","v":0},{"$f":"InpActive!G181","v":"%"},{"$f":"InpActive!H181","v":0},{"$f":"InpActive!I181","v":0},{"$f":"InpActive!J181","v":0},{"$f":"InpActive!K181","v":0},{"$f":"InpActive!L181","v":0},{"$f":"InpActive!M181","v":0},{"$f":"InpActive!N181","v":0},{"$f":"InpActive!O181","v":0},{"$f":"InpActive!P181","v":0}]
[null,null,null,null,"Totex profile - Cost Sharing - TTT",null,"%",{"$f":" SUM(J72:P72)","v":0},null,{"$f":" SUM(J70:J71)","v":0},0,0,0,0,0,0]
[null,null,null,null,"Totex profile - Cost Sharing - 5 year percentage - TTT",{"$f":"$H$72","v":0},"%"]
[]
[null,null,null,null,{"$f":" E$73","v":"Totex profile - Cost Sharing - 5 year percentage - TTT"},{"$f":" F$73","v":0},{"$f":" G$73","v":"%"}]
[null,null,null,null,"TTT Totex profile - Cost Sharing 100% check",{"$f":" IF(OR(F75 = 1, F75 = 0), 0, 1)","v":0},"Check"]
[]
[null,null,null,null,{"$f":"InpActive!E185","v":"Net totex available for cost sharing - TTT - Real"},{"$f":"InpActive!F185","v":0},{"$f":"InpActive!G185","v":"£m"}]
[null,null,null,null,{"$f":" E$72","v":"Totex profile - Cost Sharing - TTT"},0,"%",0,0,0,0,0,0,0,0,0]
[null,null,null,null,"Net totex available for cost sharing profiled - TTT - Real",null,"£m",{"$f":" SUM(J80:P80)","v":0},null,{"$f":" J79 * $F78","v":0},0,0,0,0,0,0]
[]
[null,null,null,null,{"$f":"E$80","v":"Net totex available for cost sharing profiled - TTT - Real"},0,"£m",0,0,0,0,0,0,0,0,0]
[null,null,null,null,{"$f":" E$40","v":"Variance to forecast totex for wage adjustment - TTT"},0,"£m",0,0,0,0,0,0,0,0,0]
[null,null,null,null,{"$f":"InpActive!E188","v":"Total final WINEP reconciliation - TTT - real"},{"$f":"InpActive!F188","v":0},{"$f":"InpActive!G188","v":"£m"},{"$f":"InpActive!H188","v":0},{"$f":"InpActive!I188","v":0},{"$f":"InpActive!J188","v":0},{"$f":"InpActive!K188","v":0},{"$f":"InpActive!L188","v":0},{"$f":"InpActive!M188","v":0},{"$f":"InpActive!N188","v":0},{"$f":"InpActive!O188","v":0},{"$f":"InpActive!P188","v":0}]
[null,null,null,null,{"$f":"E61","v":"Performance related pay recovery mechanism adjustment  - TTT - real"},0,"£m",0,0,0,0,0,0,0,0,0]
[null,null,null,null,"Net totex available for cost sharing after adjustments profiled - TTT - Real",null,"£m",{"$f":" SUM(J86:P86)","v":0},null,{"$f":"SUM(J82:J85)","v":0},{"$f":"SUM(K82:K85)","v":0},{"$f":"SUM(L82:L85)","v":0},0,0,0,0]
[]
[null,null,null,"Variance to forecast net totex for cost sharing"]
[null,null,null,null,{"$f":" E$67","v":"Actual net totex for cost sharing reconciliation - TTT - Real"},0,"£m",0,0,0,0,0,0,0,0,0]
[null,null,null,null,{"$f":" E$86","v":"Net totex available for cost sharing after adjustments profiled - TTT - Real"},0,"£m",0,0,0,0,0,0,0,0,0]
[null,null,null,null,"Variance to forecast net totex for cost sharing - TTT - Real",null,"£m",{"$f":" SUM(J91:P91)","v":0},null,{"$f":" J89 - J90","v":0},0,0,0,0,0,0]
[]
[null,null,null,"Variance to forecast net totex for cost sharing - Time adjusted"]
[]
[null,null,null,null,{"$f":" E$91","v":"Variance to forecast net totex for cost sharing - TTT - Real"},0,"£m",0,0,0,0,0,0,0,0,0]
[null,null,null,null,{"$f":" E$46","v":"Time value of money factor - TTT"},0,"Factor",0,0,1,1,1,1,1,1,1]
[null,null,null,null,"Time adjusted variance to forecast net totex for cost sharing - TTT",null,"£m",{"$f":" SUM(J97:P97)","v":0},null,{"$f":" J95 * J96","v":0},0,0,0,0,0,0]
[null,null,null,null,"Total variance to forecast net totex for cost sharing - TTT",{"$f":" $H97","v":0},"£m"]
[]
[null,null,null,"Under / Overperformance on net totex for cost sharing"]
[]
[null,null,null,null,{"$f":" E$98","v":"Total variance to forecast net totex for cost sharing - TTT"},{"$f":" F$98","v":0},{"$f":" G$98","v":"£m"}]
[null,null,null,null,{"$f":" InpActive!E$276","v":"Outperformance Rate - TTT"},{"$f":" InpActive!F$276","v":0},{"$f":" InpActive!G$276","v":"%"}]
[null,null,null,null,{"$f":" InpActive!E$277","v":"Underperformance Rate - TTT"},{"$f":" InpActive!F$277","v":0},{"$f":" InpActive!G$277","v":"%"}]
[null,null,null,null,{"$f":"\"Active Sharing Rate - \"& INDEX(E103:E104,MATCH(F105,F103:F104,0))","v":"Active Sharing Rate - Outperformance Rate - TTT"},{"$f":"IF(F102<0,F103,F104)","v":0},"%"]
[]
[null,null,null,null,{"$f":" E$98","v":"Total variance to forecast net totex for cost sharing - TTT"},{"$f":" F$98","v":0},{"$f":" G$98","v":"£m"}]
[null,null,null,null,{"$f":"E$105","v":"Active Sharing Rate - Outperformance Rate - TTT"},{"$f":"F$105","v":0},{"$f":"G$105","v":"%"}]
[null,null,null,null,"Active adjustment for cost sharing - Net totex for cost sharing - TTT - Real",{"$f":" F107 * (1-F108)","v":0},"£m"]
[]
[null,null,null,null,{"$f":"E109","v":"Active adjustment for cost sharing - Net totex for cost sharing - TTT - Real"},{"$f":"F109","v":0},{"$f":"G109","v":"£m"}]
[null,null,null,null,{"$f":"E51","v":"(Under)/Overfunded wage related totex at PR19 - TTT"},{"$f":"F51","v":0},{"$f":"G51","v":"£m"}]
[null,null,null,null,{"$f":"E62","v":"Total Performance related pay recovery mechanism adjustment  - TTT - real"},{"$f":"F62","v":0},"£m"]
[null,null,null,null,"Total adjustment for cost sharing after ex ante allowance - TTT - Real",{"$f":" F111 - F112 + F113","v":0},"£m"]
[]
[null,null,"Cost sharing adjustment RCV/Revenue Split"]
[]
[null,null,null,null,{"$f":"E$114","v":"Total adjustment for cost sharing after ex ante allowance - TTT - Real"},{"$f":"F$114","v":0},{"$f":"G$114","v":"£m"}]
[null,null,null,null,{"$f":"InpActive!E$190","v":"Weighted average PAYG rate - TTT"},{"$f":"InpActive!F$190","v":0},{"$f":"InpActive!G$190","v":"%"}]
[null,null,null,null,"Cost sharing revenue adjustment - TTT - Real",{"$f":" F118 * $F$119","v":0},"£m"]
[]
[null,null,null,null,{"$f":"E$114","v":"Total adjustment for cost sharing after ex ante allowance - TTT - Real"},{"$f":"F$114","v":0},{"$f":"G$114","v":"£m"}]
[null,null,null,null,{"$f":"InpActive!E$190","v":"Weighted average PAYG rate - TTT"},{"$f":"InpActive!F$190","v":0},{"$f":"InpActive!G$190","v":"%"}]
[null,null,null,null,"Cost sharing RCV adjustment - TTT - Real",{"$f":" F122 * (1 - $F$123)","v":0},"£m"]
[]
[]
["END OF SHEET"]

{"sheet":"Green Recovery","index":17,"n_rows":131,"n_cols":16,"rows_kept":131,"cut":false,"hidden":false,"merged":[]}
[{"$f":" RIGHT(CELL(\"filename\", $A$1), LEN(CELL(\"filename\", $A$1)) - SEARCH(\"]\", CELL(\"filename\", $A$1)))","v":{"$error":"#VALUE!"}}]
[null,null,null,null,{"$f":"Time!E$22","v":"Model Period BEG"},null,null,null,null,{"$f":"Time!J$22","v":"2019-04-01"},{"$f":"Time!K$22","v":"2020-04-01"},{"$f":"Time!L$22","v":"2021-04-01"},{"$f":"Time!M$22","v":"2022-04-01"},{"$f":"Time!N$22","v":"2023-04-01"},{"$f":"Time!O$22","v":"2024-04-01"},{"$f":"Time!P$22","v":"2025-04-01"}]
[null,null,null,null,{"$f":"Time!E$23","v":"Model Period END"},{"$f":"Check!F$8","v":0},"Error chks",null,null,{"$f":"Time!J$23","v":"2020-03-31"},{"$f":"Time!K$23","v":"2021-03-31"},{"$f":"Time!L$23","v":"2022-03-31"},{"$f":"Time!M$23","v":"2023-03-31"},{"$f":"Time!N$23","v":"2024-03-31"},{"$f":"Time!O$23","v":"2025-03-31"},{"$f":"Time!P$23","v":"2026-03-31"}]
[null,null,null,null,{"$f":"Time!E$59","v":"Pre Forecast vs Forecast"},null,null,null,null,{"$f":"Time!J$59","v":"Pre Fcst"},{"$f":"Time!K$59","v":"Forecast"},{"$f":"Time!L$59","v":"Forecast"},{"$f":"Time!M$59","v":"Forecast"},{"$f":"Time!N$59","v":"Forecast"},{"$f":"Time!O$59","v":"Forecast"},{"$f":"Time!P$59","v":"Post-Fcst"}]
[null,null,null,null,{"$f":"Time!E$101","v":"Financial Year Ending"},null,null,null,null,{"$f":"Time!J$101","v":2020},{"$f":"Time!K$101","v":2021},{"$f":"Time!L$101","v":2022},{"$f":"Time!M$101","v":2023},{"$f":"Time!N$101","v":2024},{"$f":"Time!O$101","v":2025},{"$f":"Time!P$101","v":2026}]
[null,null,null,null,{"$f":"Time!E$11","v":"Model column counter"},"Constant","Unit","Total",null,{"$f":"Time!J$11","v":1},{"$f":"Time!K$11","v":2},{"$f":"Time!L$11","v":3},{"$f":"Time!M$11","v":4},{"$f":"Time!N$11","v":5},{"$f":"Time!O$11","v":6},{"$f":"Time!P$11","v":7}]
[]
[]
["ACTIVE GREEN RECOVERY COST SHARING RATE"]
[]
[null,null,"Active Sharing Rates -WR/WN"]
[]
[null,null,null,null,{"$f":"E37","v":"Variance to green recovery expenditure - WR - real"},{"$f":"F37","v":0},{"$f":"G37","v":"£m"}]
[null,null,null,null,{"$f":"E73","v":"Variance to green recovery expenditure - WN - real"},{"$f":"F73","v":0},{"$f":"G73","v":"£m"}]
[null,null,null,null,{"$f":"E108","v":"Variance to green recovery expenditure - WWN - real"},0,"£m"]
[null,null,null,null,"Total Variance to green recovery expenditure - real",{"$f":"SUM(F13:F15)","v":0},"£m"]
[]
[null,null,null,null,{"$f":"E$16","v":"Total Variance to green recovery expenditure - real"},{"$f":"F$16","v":0},"£m"]
[null,null,null,null,{"$f":"InpActive!E$212","v":"Green Recovery Outperformance Rate "},{"$f":"InpActive!F$212","v":0.1},{"$f":"InpActive!G$212","v":"%"}]
[null,null,null,null,{"$f":"InpActive!E$213","v":"Green Recovery Underperformance Rate "},{"$f":"InpActive!F$213","v":0.5},{"$f":"InpActive!G$213","v":"%"}]
[null,null,null,null,{"$f":"\"Active Sharing Rate - \"& INDEX(E19:E20,MATCH(F21,F19:F20,0))","v":"Active Sharing Rate - Green Recovery Underperformance Rate "},{"$f":"IF(F18<0,F19,F20)","v":0.5},"%"]
[]
[]
["WATER RESOURCES"]
[]
[null,null,null,null,{"$f":"InpActive!E$197","v":"Actual Green Recovery Expenditure - WR - nominal"},{"$f":"InpActive!F$197","v":0},{"$f":"InpActive!G$197","v":"£m"},{"$f":"InpActive!H$197","v":0},{"$f":"InpActive!I$197","v":0},{"$f":"InpActive!J$197","v":0},{"$f":"InpActive!K$197","v":0},{"$f":"InpActive!L$197","v":0},{"$f":"InpActive!M$197","v":0},{"$f":"InpActive!N$197","v":0},{"$f":"InpActive!O$197","v":0},{"$f":"InpActive!P$197","v":0}]
[null,null,null,null,{"$f":"Index!E$43","v":"CPI(H): Fin year average - inflate from base year 2017-18 average - CALC"},{"$f":"Index!F$43","v":0},{"$f":"Index!G$43","v":"%"},{"$f":"Index!H$43","v":0},{"$f":"Index!I$43","v":0},{"$f":"Index!J$43","v":1.0386214616983847},{"$f":"Index!K$43","v":1.0469374700143934},{"$f":"Index!L$43","v":1.0853990084759317},{"$f":"Index!M$43","v":1.1806332960179113},{"$f":"Index!N$43","v":1.2461218615064769},{"$f":"Index!O$43","v":1.2831440908363987},{"$f":"Index!P$43","v":1.3134495442187752}]
[null,null,null,null,"Actual Green Recovery Expenditure - WR - real",null,"£m",{"$f":" SUM(J28:P28)","v":0},null,{"$f":" J26 / J27","v":0},{"$f":" K26 / K27","v":0},{"$f":" L26 / L27","v":0},0,0,0,0]
[]
[null,null,null,null,{"$f":"E28","v":"Actual Green Recovery Expenditure - WR - real"},{"$f":"F28","v":0},"£m",0,0,0,{"$f":"K28","v":0},0,0,0,0,0]
[null,null,null,null,{"$f":"Time!E$54","v":"Forecast Period Flag"},{"$f":"Time!F$54","v":0},{"$f":"Time!G$54","v":"flag"},{"$f":"Time!H$54","v":5},{"$f":"Time!I$54","v":0},{"$f":"Time!J$54","v":0},{"$f":"Time!K$54","v":1},{"$f":"Time!L$54","v":1},{"$f":"Time!M$54","v":1},{"$f":"Time!N$54","v":1},{"$f":"Time!O$54","v":1},{"$f":"Time!P$54","v":0}]
[null,null,null,null,"Actual Green Recovery Expenditure for cost sharing  - WR - real",null,"£m",{"$f":" SUM(J32:P32)","v":0},null,{"$f":" J30 * J31","v":0},{"$f":" K30 * K31","v":0},0,0,0,0,0]
[]
[null,null,null,"Variance to forecast totex for green recovery expenditure"]
[null,null,null,null,{"$f":" E$32","v":"Actual Green Recovery Expenditure for cost sharing  - WR - real"},0,"£m",0,0,0,0,{"$f":" L$32","v":0},0,0,0,0]
[null,null,null,null,{"$f":"InpActive!E$198","v":"Total adjusted cost allowance - WR - real"},{"$f":"InpActive!F$198","v":0},{"$f":"InpActive!G$198","v":"£m"},{"$f":"InpActive!H$198","v":0},{"$f":"InpActive!I$198","v":0},{"$f":"InpActive!J$198","v":0},{"$f":"InpActive!K$198","v":0},{"$f":"InpActive!L$198","v":0},{"$f":"InpActive!M$198","v":0},{"$f":"InpActive!N$198","v":0},{"$f":"InpActive!O$198","v":0},{"$f":"InpActive!P$198","v":0}]
[null,null,null,null,"Variance to green recovery expenditure - WR - real",{"$f":" H35 - H36","v":0},"£m",{"$f":" SUM(J37:P37)","v":0}]
[]
[null,null,null,null,{"$f":" E$32","v":"Actual Green Recovery Expenditure for cost sharing  - WR - real"},0,"£m",0,0,0,0,0,0,0,0,0]
[null,null,null,null,{"$f":"E37","v":"Variance to green recovery expenditure - WR - real"},{"$f":"F37","v":0},{"$f":"G37","v":"£m"}]
[null,null,null,null,"Apportioned variance to GRE - WR - real",null,"£m",{"$f":" SUM(J41:O41)","v":0},null,{"$f":"IF($F$40=0,0, $F$40 * (J39/SUM($K$39:$O$39)))","v":0},{"$f":"IF($F$40=0,0, $F$40 * (K39/SUM($K$39:$O$39)))","v":0},{"$f":"IF($F$40=0,0, $F$40 * (L39/SUM($K$39:$O$39)))","v":0},0,0,0,0]
[]
[null,null,null,"Variance to forecast totex for green recovery expenditure - Time adjusted"]
[null,null,null,null,{"$f":" InpActive!E$288","v":"Financing cost index"},{"$f":" InpActive!F$288","v":0},{"$f":" InpActive!G$288","v":"Index"},{"$f":" InpActive!H$288","v":0},{"$f":" InpActive!I$288","v":0},{"$f":" InpActive!J$288","v":0},{"$f":" InpActive!K$288","v":4},{"$f":" InpActive!L$288","v":3},{"$f":" InpActive!M$288","v":2},{"$f":" InpActive!N$288","v":1},{"$f":" InpActive!O$288","v":0},{"$f":" InpActive!P$288","v":0}]
[null,null,null,null,{"$f":" InpActive!E$290","v":"Real WACC CPIH Deflated - WR"},{"$f":" InpActive!F$290","v":2.92E-2},{"$f":" InpActive!G$290","v":"%"}]
[null,null,null,null,"Time value of money factor - WR",null,"Factor",null,null,{"$f":"(1+$F45) ^ J44","v":1},{"$f":"(1+$F45) ^ K44","v":1.122016155346969},1.0901828170879997,1.0592526399999997,1.0291999999999999,1,1]
[]
[null,null,null,null,{"$f":" E$41","v":"Apportioned variance to GRE - WR - real"},0,"£m",0,0,0,0,0,0,0,0,0]
[null,null,null,null,{"$f":" E$46","v":"Time value of money factor - WR"},0,"Factor",0,0,1,1.122016155346969,1.0901828170879997,1.0592526399999997,1.0291999999999999,1,1]
[null,null,null,null,"Time adjusted variance to green recovery expenditure - WR - real",null,"£m",{"$f":" SUM(J50:P50)","v":0},null,{"$f":" J48 * J49","v":0},{"$f":" K48 * K49","v":0},{"$f":" L48 * L49","v":0},0,0,0,0]
[null,null,null,null,"Total variance to green recovery expenditure - WR - real",{"$f":" $H50","v":0},"£m"]
[]
[null,null,null,"Under / Overperformance on green recovery expenditure"]
[]
[null,null,null,null,{"$f":" E$51","v":"Total variance to green recovery expenditure - WR - real"},{"$f":" F$51","v":0},{"$f":" G$51","v":"£m"}]
[null,null,null,null,{"$f":"E$21","v":"Active Sharing Rate - Green Recovery Underperformance Rate "},{"$f":"F$21","v":0.5},"%"]
[null,null,null,null,"Active RCV adjustment for cost sharing - Green Recovery Expenditure - WR - Real",{"$f":" F55 * (1-F56)","v":0},"£m"]
[]
[]
["WATER NETWORK"]
[]
[null,null,null,null,{"$f":"InpActive!E$202","v":"Actual Green Recovery Expenditure - WN - nominal"},{"$f":"InpActive!F$202","v":0},{"$f":"InpActive!G$202","v":"£m"},{"$f":"InpActive!H$202","v":0},{"$f":"InpActive!I$202","v":0},{"$f":"InpActive!J$202","v":0},{"$f":"InpActive!K$202","v":0},{"$f":"InpActive!L$202","v":0},{"$f":"InpActive!M$202","v":0},{"$f":"InpActive!N$202","v":0},{"$f":"InpActive!O$202","v":0},{"$f":"InpActive!P$202","v":0}]
[null,null,null,null,{"$f":"Index!E$43","v":"CPI(H): Fin year average - inflate from base year 2017-18 average - CALC"},{"$f":"Index!F$43","v":0},{"$f":"Index!G$43","v":"%"},{"$f":"Index!H$43","v":0},{"$f":"Index!I$43","v":0},{"$f":"Index!J$43","v":1.0386214616983847},{"$f":"Index!K$43","v":1.0469374700143934},{"$f":"Index!L$43","v":1.0853990084759317},{"$f":"Index!M$43","v":1.1806332960179113},{"$f":"Index!N$43","v":1.2461218615064769},{"$f":"Index!O$43","v":1.2831440908363987},{"$f":"Index!P$43","v":1.3134495442187752}]
[null,null,null,null,"Actual Green Recovery Expenditure - WN - real",null,"£m",{"$f":" SUM(J64:P64)","v":0},null,{"$f":" J62 / J63","v":0},{"$f":" K62 / K63","v":0},{"$f":" L62 / L63","v":0},0,0,0,0]
[]
[null,null,null,null,{"$f":"E64","v":"Actual Green Recovery Expenditure - WN - real"},{"$f":"F64","v":0},"£m",0,0,0,{"$f":"K64","v":0},0,0,0,0,0]
[null,null,null,null,{"$f":"Time!E$54","v":"Forecast Period Flag"},{"$f":"Time!F$54","v":0},{"$f":"Time!G$54","v":"flag"},{"$f":"Time!H$54","v":5},{"$f":"Time!I$54","v":0},{"$f":"Time!J$54","v":0},{"$f":"Time!K$54","v":1},{"$f":"Time!L$54","v":1},{"$f":"Time!M$54","v":1},{"$f":"Time!N$54","v":1},{"$f":"Time!O$54","v":1},{"$f":"Time!P$54","v":0}]
[null,null,null,null,"Actual Green Recovery Expenditure for cost sharing  - WN - real",null,"£m",{"$f":" SUM(J68:P68)","v":0},null,{"$f":" J66 * J67","v":0},{"$f":" K66 * K67","v":0},0,0,0,0,0]
[]
[null,null,null,"Variance to forecast totex for green recovery expenditure"]
[null,null,null,null,{"$f":" E$68","v":"Actual Green Recovery Expenditure for cost sharing  - WN - real"},0,"£m",0,0,0,0,0,0,0,0,0]
[null,null,null,null,{"$f":"InpActive!E$203","v":"Total adjusted cost allowance - WN - real"},{"$f":"InpActive!F$203","v":0},{"$f":"InpActive!G$203","v":"£m"},{"$f":"InpActive!H$203","v":0},{"$f":"InpActive!I$203","v":0},{"$f":"InpActive!J$203","v":0},{"$f":"InpActive!K$203","v":0},{"$f":"InpActive!L$203","v":0},{"$f":"InpActive!M$203","v":0},{"$f":"InpActive!N$203","v":0},{"$f":"InpActive!O$203","v":0},{"$f":"InpActive!P$203","v":0}]
[null,null,null,null,"Variance to green recovery expenditure - WN - real",{"$f":" H71 - H72","v":0},"£m",{"$f":" SUM(J73:O73)","v":0}]
[]
[null,null,null,null,{"$f":" E$68","v":"Actual Green Recovery Expenditure for cost sharing  - WN - real"},0,"£m",0,0,0,0,0,0,0,0,0]
[null,null,null,null,{"$f":"E73","v":"Variance to green recovery expenditure - WN - real"},{"$f":"F73","v":0},"£m"]
[null,null,null,null,"Apportioned variance to GRE - WN - real",null,"£m",{"$f":" SUM(J77:O77)","v":0},null,{"$f":"IF($F$76 = 0, 0, $F$76*(J75/SUM($K$75:$O$75)))","v":0},0,0,0,0,0,0]
[]
[null,null,null,"Variance to forecast totex for green recovery expenditure - Time adjusted"]
[null,null,null,null,{"$f":" InpActive!E$288","v":"Financing cost index"},{"$f":" InpActive!F$288","v":0},{"$f":" InpActive!G$288","v":"Index"},{"$f":" InpActive!H$288","v":0},{"$f":" InpActive!I$288","v":0},{"$f":" InpActive!J$288","v":0},{"$f":" InpActive!K$288","v":4},{"$f":" InpActive!L$288","v":3},{"$f":" InpActive!M$288","v":2},{"$f":" InpActive!N$288","v":1},{"$f":" InpActive!O$288","v":0},{"$f":" InpActive!P$288","v":0}]
[null,null,null,null,{"$f":" InpActive!E$291","v":"Real WACC CPIH Deflated - WN"},{"$f":" InpActive!F$291","v":2.92E-2},{"$f":" InpActive!G$291","v":"%"}]
[null,null,null,null,"Time value of money factor - WN",null,"Factor",null,null,{"$f":"(1+$F81) ^ J80","v":1},{"$f":"(1+$F81) ^ K80","v":1.122016155346969},1.0901828170879997,1.0592526399999997,1.0291999999999999,1,1]
[]
[null,null,null,null,{"$f":" E$77","v":"Apportioned variance to GRE - WN - real"},0,"£m",0,0,0,0,0,0,0,0,0]
[null,null,null,null,{"$f":" E$82","v":"Time value of money factor - WN"},0,"Factor",0,0,1,1.122016155346969,1.0901828170879997,1.0592526399999997,1.0291999999999999,1,1]
[null,null,null,null,"Time adjusted variance to green recovery expenditure - WN - real",null,"£m",{"$f":" SUM(J86:P86)","v":0},null,{"$f":" J84 * J85","v":0},{"$f":" K84 * K85","v":0},0,{"$f":" M84 * M85","v":0},0,0,0]
[null,null,null,null,"Total variance to green recovery expenditure - WN - real",{"$f":" $H86","v":0},"£m"]
[]
[null,null,null,"Under / Overperformance on green recovery expenditure"]
[]
[null,null,null,null,{"$f":" E$87","v":"Total variance to green recovery expenditure - WN - real"},{"$f":" F$87","v":0},"£m"]
[null,null,null,null,{"$f":"E$21","v":"Active Sharing Rate - Green Recovery Underperformance Rate "},{"$f":"F$21","v":0.5},"%"]
[null,null,null,null,"Active RCV adjustment for cost sharing - Green Recovery Expenditure - WN - Real",{"$f":" F91 * (1-F92)","v":0},"£m"]
[]
["WASTEWATER NETWORK"]
[]
[null,null,null,null,{"$f":"InpActive!E$207","v":"Actual Green Recovery Expenditure - WWN - nominal"},{"$f":"InpActive!F$207","v":0},{"$f":"InpActive!G$207","v":"£m"},{"$f":"InpActive!H$207","v":0},{"$f":"InpActive!I$207","v":0},{"$f":"InpActive!J$207","v":0},{"$f":"InpActive!K$207","v":0},{"$f":"InpActive!L$207","v":0},{"$f":"InpActive!M$207","v":0},{"$f":"InpActive!N$207","v":0},{"$f":"InpActive!O$207","v":0},{"$f":"InpActive!P$207","v":0}]
[null,null,null,null,{"$f":"Index!E$43","v":"CPI(H): Fin year average - inflate from base year 2017-18 average - CALC"},{"$f":"Index!F$43","v":0},{"$f":"Index!G$43","v":"%"},{"$f":"Index!H$43","v":0},{"$f":"Index!I$43","v":0},{"$f":"Index!J$43","v":1.0386214616983847},{"$f":"Index!K$43","v":1.0469374700143934},{"$f":"Index!L$43","v":1.0853990084759317},{"$f":"Index!M$43","v":1.1806332960179113},{"$f":"Index!N$43","v":1.2461218615064769},{"$f":"Index!O$43","v":1.2831440908363987},{"$f":"Index!P$43","v":1.3134495442187752}]
[null,null,null,null,"Actual Green Recovery Expenditure - WWN - real",null,"£m",{"$f":" SUM(J99:P99)","v":0},null,{"$f":" J97 / J98","v":0},{"$f":" K97 / K98","v":0},{"$f":" L97 / L98","v":0},0,0,0,0]
[]
[null,null,null,null,{"$f":"E99","v":"Actual Green Recovery Expenditure - WWN - real"},{"$f":"F99","v":0},"£m",0,0,0,{"$f":"K99","v":0},0,0,0,0,0]
[null,null,null,null,{"$f":"Time!E$54","v":"Forecast Period Flag"},{"$f":"Time!F$54","v":0},{"$f":"Time!G$54","v":"flag"},{"$f":"Time!H$54","v":5},{"$f":"Time!I$54","v":0},{"$f":"Time!J$54","v":0},{"$f":"Time!K$54","v":1},{"$f":"Time!L$54","v":1},{"$f":"Time!M$54","v":1},{"$f":"Time!N$54","v":1},{"$f":"Time!O$54","v":1},{"$f":"Time!P$54","v":0}]
[null,null,null,null,"Actual Green Recovery Expenditure for cost sharing  - WWN - real",null,"£m",{"$f":" SUM(J103:P103)","v":0},null,{"$f":" J101 * J102","v":0},{"$f":" K101 * K102","v":0},0,0,0,0,0]
[]
[null,null,null,"Variance to forecast totex for green recovery expenditure"]
[null,null,null,null,{"$f":" E$103","v":"Actual Green Recovery Expenditure for cost sharing  - WWN - real"},0,"£m",0,0,0,0,0,0,0,0,0]
[null,null,null,null,{"$f":"InpActive!E$208","v":"Total adjusted cost allowance - WWN - real"},{"$f":"InpActive!F$208","v":0},{"$f":"InpActive!G$208","v":"£m"},{"$f":"InpActive!H$208","v":0},{"$f":"InpActive!I$208","v":0},{"$f":"InpActive!J$208","v":0},{"$f":"InpActive!K$208","v":0},{"$f":"InpActive!L$208","v":0},{"$f":"InpActive!M$208","v":0},{"$f":"InpActive!N$208","v":0},{"$f":"InpActive!O$208","v":0},{"$f":"InpActive!P$208","v":0}]
[null,null,null,null,"Variance to green recovery expenditure - WWN - real",{"$f":" H106 - H107","v":0},"£m"]
[]
[null,null,null,null,{"$f":" E$106","v":"Actual Green Recovery Expenditure for cost sharing  - WWN - real"},0,"£m",0,0,0,0,0,0,0,0,0]
[null,null,null,null,{"$f":"E108","v":"Variance to green recovery expenditure - WWN - real"},{"$f":"F108","v":0},"£m"]
[null,null,null,null,"Apportioned variance to GRE - WWN - real",null,"£m",{"$f":" SUM(J112:O112)","v":0},null,{"$f":"IF($F$111 = 0, 0, $F$111*(J110/SUM($K$110:$O$110)))","v":0},0,0,0,0,0,0]
[]
[]
[null,null,null,"Variance to forecast totex for green recovery expenditure - Time adjusted"]
[null,null,null,null,{"$f":" InpActive!E$288","v":"Financing cost index"},{"$f":" InpActive!F$288","v":0},{"$f":" InpActive!G$288","v":"Index"},{"$f":" InpActive!H$288","v":0},{"$f":" InpActive!I$288","v":0},{"$f":" InpActive!J$288","v":0},{"$f":" InpActive!K$288","v":4},{"$f":" InpActive!L$288","v":3},{"$f":" InpActive!M$288","v":2},{"$f":" InpActive!N$288","v":1},{"$f":" InpActive!O$288","v":0},{"$f":" InpActive!P$288","v":0}]
[null,null,null,null,{"$f":" InpActive!E$292","v":"Real WACC CPIH Deflated - WWN"},{"$f":" InpActive!F$292","v":2.92E-2},{"$f":" InpActive!G$292","v":"%"}]
[null,null,null,null,"Time value of money factor - WWN",null,"Factor",null,null,{"$f":"(1+$F117) ^ J116","v":1},{"$f":"(1+$F117) ^ K116","v":1.122016155346969},{"$f":"(1+$F117) ^ L116","v":1.0901828170879997},1.0592526399999997,1.0291999999999999,1,1]
[]
[null,null,null,null,{"$f":"E112","v":"Apportioned variance to GRE - WWN - real"},{"$f":"F112","v":0},"£m",0,0,0,{"$f":"K112","v":0},0,0,0,0,0]
[null,null,null,null,{"$f":" E$118","v":"Time value of money factor - WWN"},0,"Factor",0,0,1,1.122016155346969,1.0901828170879997,1.0592526399999997,1.0291999999999999,1,1]
[null,null,null,null,"Time adjusted variance to green recovery expenditure - WWN - real",null,"£m",{"$f":" SUM(J122:P122)","v":0},null,{"$f":" J120 * J121","v":0},{"$f":" K120 * K121","v":0},0,0,0,0,0]
[null,null,null,null,"Total variance to green recovery expenditure - WWN - real",{"$f":" $H122","v":0},"£m"]
[]
[null,null,null,"Under / Overperformance on green recovery expenditure"]
[]
[null,null,null,null,{"$f":" E$123","v":"Total variance to green recovery expenditure - WWN - real"},{"$f":" F$123","v":0},"£m"]
[null,null,null,null,{"$f":"E$21","v":"Active Sharing Rate - Green Recovery Underperformance Rate "},{"$f":"F$21","v":0.5},"%"]
[null,null,null,null,"Active RCV adjustment for cost sharing - Green Recovery Expenditure - WWN - Real",{"$f":" F127 * (1-F128)","v":0},"£m"]
[]
["END OF SHEET"]

{"sheet":"Outputs-->","index":18,"n_rows":0,"n_cols":0,"rows_kept":0,"cut":false,"hidden":false,"merged":[]}

{"sheet":"Outputs","index":19,"n_rows":115,"n_cols":16,"rows_kept":115,"cut":false,"hidden":false,"merged":[]}
[{"$f":" RIGHT(CELL(\"filename\", $A$1), LEN(CELL(\"filename\", $A$1)) - SEARCH(\"]\", CELL(\"filename\", $A$1)))","v":{"$error":"#VALUE!"}}]
[null,null,null,null,{"$f":"Time!E$22","v":"Model Period BEG"},null,null,null,null,{"$f":"Time!J$22","v":"2019-04-01"},{"$f":"Time!K$22","v":"2020-04-01"},{"$f":"Time!L$22","v":"2021-04-01"},{"$f":"Time!M$22","v":"2022-04-01"},{"$f":"Time!N$22","v":"2023-04-01"},{"$f":"Time!O$22","v":"2024-04-01"},{"$f":"Time!P$22","v":"2025-04-01"}]
[null,null,null,null,{"$f":"Time!E$23","v":"Model Period END"},{"$f":"Check!F$8","v":0},"Error chks",null,null,{"$f":"Time!J$23","v":"2020-03-31"},{"$f":"Time!K$23","v":"2021-03-31"},{"$f":"Time!L$23","v":"2022-03-31"},{"$f":"Time!M$23","v":"2023-03-31"},{"$f":"Time!N$23","v":"2024-03-31"},{"$f":"Time!O$23","v":"2025-03-31"},{"$f":"Time!P$23","v":"2026-03-31"}]
[null,null,null,null,{"$f":"Time!E$59","v":"Pre Forecast vs Forecast"},null,null,null,null,{"$f":"Time!J$59","v":"Pre Fcst"},{"$f":"Time!K$59","v":"Forecast"},{"$f":"Time!L$59","v":"Forecast"},{"$f":"Time!M$59","v":"Forecast"},{"$f":"Time!N$59","v":"Forecast"},{"$f":"Time!O$59","v":"Forecast"},{"$f":"Time!P$59","v":"Post-Fcst"}]
[null,null,null,null,{"$f":"Time!E$101","v":"Financial Year Ending"},null,null,null,null,{"$f":"Time!J$101","v":2020},{"$f":"Time!K$101","v":2021},{"$f":"Time!L$101","v":2022},{"$f":"Time!M$101","v":2023},{"$f":"Time!N$101","v":2024},{"$f":"Time!O$101","v":2025},{"$f":"Time!P$101","v":2026}]
[null,null,null,null,{"$f":"Time!E$11","v":"Model column counter"},"Constant","Unit","Total",null,{"$f":"Time!J$11","v":1},{"$f":"Time!K$11","v":2},{"$f":"Time!L$11","v":3},{"$f":"Time!M$11","v":4},{"$f":"Time!N$11","v":5},{"$f":"Time!O$11","v":6},{"$f":"Time!P$11","v":7}]
[]
["WATER RESOURCES"]
[]
[null,"Cost sharing"]
[null,null,null,null,{"$f":"'Cost sharing calculations'!E$180","v":"Total adjustment for cost sharing after ex ante allowance & wage adjustment - WR - Real"},{"$f":"'Cost sharing calculations'!F$180","v":-5.4878081983363485},{"$f":"'Cost sharing calculations'!G$180","v":"£m"}]
[null,null,null,null,{"$f":"'Cost sharing calculations'!E$198","v":"Wholesaler bad debt adjustment - WR"},{"$f":"'Cost sharing calculations'!F$198","v":0},{"$f":"'Cost sharing calculations'!G$198","v":"£m"}]
[null,null,null,null,{"$f":"'Cost sharing calculations'!E$208","v":"Cost sharing revenue adjustment - WR - Real"},{"$f":"'Cost sharing calculations'!F$208","v":-3.5176850551335996},{"$f":"'Cost sharing calculations'!G$208","v":"£m"}]
[null,null,null,null,{"$f":"'Cost sharing calculations'!E$212","v":"Cost sharing RCV adjustment - WR - Real"},{"$f":"'Cost sharing calculations'!F$212","v":-1.9701231432027491},{"$f":"'Cost sharing calculations'!G$212","v":"£m"}]
[null,null,null,null,"Water Resources cost sharing 100% check",{"$f":" IF(SUM(F11:F12) <> SUM(F13:F14), 1, 0)","v":0},"Check"]
[]
[null,"Abstraction & Business Rates uncertainty mechanism"]
[null,null,null,null,{"$f":"'Abstraction & Rates'!E82","v":"Active adjustment for abstraction charges & business rates uncertainty mechanism - WR - Real"},{"$f":"'Abstraction & Rates'!F82","v":0.72030848098230493},{"$f":"'Abstraction & Rates'!G82","v":"£m"}]
[null,null,null,null,{"$f":"'Abstraction & Rates'!E86","v":"Revenue adjustment business rates and abstraction - WR - Real"},{"$f":"'Abstraction & Rates'!F86","v":0.46171773630965746},{"$f":"'Abstraction & Rates'!G86","v":"£m"}]
[null,null,null,null,{"$f":"'Abstraction & Rates'!E90","v":"RCV adjustment business rates and abstraction - WR - Real"},{"$f":"'Abstraction & Rates'!F90","v":0.25859074467264748},{"$f":"'Abstraction & Rates'!G90","v":"£m"}]
[]
[null,"Revenue adjustment"]
[null,null,null,null,{"$f":"'Cost sharing calculations'!E$208","v":"Cost sharing revenue adjustment - WR - Real"},{"$f":"'Cost sharing calculations'!F$208","v":-3.5176850551335996},{"$f":"'Cost sharing calculations'!G$208","v":"£m"}]
[null,null,null,null,{"$f":"'Abstraction & Rates'!E86","v":"Revenue adjustment business rates and abstraction - WR - Real"},{"$f":"'Abstraction & Rates'!F86","v":0.46171773630965746},{"$f":"'Abstraction & Rates'!G86","v":"£m"}]
[null,null,null,null,"Total Revenue adjustment for cost sharing - WR - Real",{"$f":" SUM(F23:F24)","v":-3.0559673188239422},"£m"]
[]
[null,"RCV adjustment"]
[null,null,null,null,{"$f":"'Cost sharing calculations'!E$212","v":"Cost sharing RCV adjustment - WR - Real"},{"$f":"'Cost sharing calculations'!F$212","v":-1.9701231432027491},{"$f":"'Cost sharing calculations'!G$212","v":"£m"}]
[null,null,null,null,{"$f":"'Abstraction & Rates'!E90","v":"RCV adjustment business rates and abstraction - WR - Real"},{"$f":"'Abstraction & Rates'!F90","v":0.25859074467264748},{"$f":"'Abstraction & Rates'!G90","v":"£m"}]
[null,null,null,null,{"$f":"'Green Recovery'!E$57","v":"Active RCV adjustment for cost sharing - Green Recovery Expenditure - WR - Real"},{"$f":"'Green Recovery'!F$57","v":0},{"$f":"'Green Recovery'!G$57","v":"£m"}]
[null,null,null,null,"Total RCV adjustment for cost sharing - WR - Real",{"$f":" SUM(F28:F30)","v":-1.7115323985301016},"£m"]
[]
[]
["WATER NETWORK"]
[]
[null,"Cost sharing"]
[null,null,null,null,{"$f":"'Cost sharing calculations'!E$347","v":"Total adjustment for cost sharing after ex ante allowance - WN - Real"},{"$f":"'Cost sharing calculations'!F$347","v":47.840564971725833},{"$f":"'Cost sharing calculations'!G$347","v":"£m"}]
[null,null,null,null,{"$f":"'Cost sharing calculations'!E$365","v":"Wholesaler bad debt adjustment - WN"},{"$f":"'Cost sharing calculations'!F$365","v":0},{"$f":"'Cost sharing calculations'!G$365","v":"£m"}]
[null,null,null,null,{"$f":"'Cost sharing calculations'!E$375","v":"Cost sharing revenue adjustment - WN - Real"},{"$f":"'Cost sharing calculations'!F$375","v":34.540887909586047},{"$f":"'Cost sharing calculations'!G$375","v":"£m"}]
[null,null,null,null,{"$f":"'Cost sharing calculations'!E$379","v":"Cost sharing RCV adjustment - WN - Real"},{"$f":"'Cost sharing calculations'!F$379","v":13.299677062139782},{"$f":"'Cost sharing calculations'!G$379","v":"£m"}]
[null,null,null,null,"Water Network cost sharing 100% check",{"$f":" IF(SUM(F37:F38) <> SUM(F39:F40), 1, 0)","v":0},"Check"]
[]
[null,"Abstraction & Business Rates uncertainty mechanism"]
[null,null,null,null,{"$f":"'Abstraction & Rates'!E$166","v":"Active adjustment for abstraction charges & business rates uncertainty mechanism - WR - Real"},{"$f":"'Abstraction & Rates'!F$166","v":-8.0012529571175168},{"$f":"'Abstraction & Rates'!G$166","v":"£m"}]
[null,null,null,null,{"$f":"'Abstraction & Rates'!E$170","v":"Revenue adjustment business rates and abstraction - WN - Real"},{"$f":"'Abstraction & Rates'!F$170","v":-5.7769046350388473},{"$f":"'Abstraction & Rates'!G$170","v":"£m"}]
[null,null,null,null,{"$f":"'Abstraction & Rates'!E$174","v":"RCV adjustment business rates and abstraction - WN - Real"},{"$f":"'Abstraction & Rates'!F$174","v":-2.2243483220786699},{"$f":"'Abstraction & Rates'!G$174","v":"£m"}]
[]
[null,"Revenue adjustment"]
[null,null,null,null,{"$f":"'Cost sharing calculations'!E$375","v":"Cost sharing revenue adjustment - WN - Real"},{"$f":"'Cost sharing calculations'!F$375","v":34.540887909586047},{"$f":"'Cost sharing calculations'!G$375","v":"£m"}]
[null,null,null,null,{"$f":"'Abstraction & Rates'!E170","v":"Revenue adjustment business rates and abstraction - WN - Real"},{"$f":"'Abstraction & Rates'!F170","v":-5.7769046350388473},{"$f":"'Abstraction & Rates'!G170","v":"£m"}]
[null,null,null,null,"Total Revenue adjustment for cost sharing - WN - Real",{"$f":" SUM(F49:F50)","v":28.763983274547201},"£m"]
[]
[null,"RCV adjustment"]
[null,null,null,null,{"$f":"'Cost sharing calculations'!E$379","v":"Cost sharing RCV adjustment - WN - Real"},{"$f":"'Cost sharing calculations'!F$379","v":13.299677062139782},{"$f":"'Cost sharing calculations'!G$379","v":"£m"}]
[null,null,null,null,{"$f":"'Abstraction & Rates'!E174","v":"RCV adjustment business rates and abstraction - WN - Real"},{"$f":"'Abstraction & Rates'!F174","v":-2.2243483220786699},{"$f":"'Abstraction & Rates'!G174","v":"£m"}]
[null,null,null,null,{"$f":"'Green Recovery'!E93","v":"Active RCV adjustment for cost sharing - Green Recovery Expenditure - WN - Real"},{"$f":"'Green Recovery'!F93","v":0},{"$f":"'Green Recovery'!G93","v":"£m"}]
[null,null,null,null,"Total RCV adjustment for cost sharing - WN - Real",{"$f":" SUM(F54:F56)","v":11.075328740061112},"£m"]
[]
[]
["WASTEWATER NETWORK"]
[]
[null,"Cost sharing"]
[null,null,null,null,{"$f":"'Cost sharing calculations'!E$520","v":"Total adjustment for cost sharing after ex ante allowance - WWN - Real"},{"$f":"'Cost sharing calculations'!F$520","v":-3.5911163289357253},{"$f":"'Cost sharing calculations'!G$520","v":"£m"}]
[null,null,null,null,{"$f":"'Cost sharing calculations'!E$538","v":"Wholesaler bad debt adjustment - WWN"},{"$f":"'Cost sharing calculations'!F$538","v":0},{"$f":"'Cost sharing calculations'!G$538","v":"£m"}]
[null,null,null,null,{"$f":"'Cost sharing calculations'!E$548","v":"Cost sharing revenue adjustment - WWN - Real"},{"$f":"'Cost sharing calculations'!F$548","v":-1.4472198805610974},{"$f":"'Cost sharing calculations'!G$548","v":"£m"}]
[null,null,null,null,{"$f":"'Cost sharing calculations'!E$552","v":"Cost sharing RCV adjustment - WWN - Real"},{"$f":"'Cost sharing calculations'!F$552","v":-2.1438964483746279},{"$f":"'Cost sharing calculations'!G$552","v":"£m"}]
[null,null,null,null,"Wastewater Network cost sharing 100% check",{"$f":" IF(SUM(F63:F64) <> SUM(F65:F66), 1, 0)","v":0},"Check"]
[]
[null,"Abstraction & Business Rates uncertainty mechanism"]
[null,null,null,null,{"$f":"'Abstraction & Rates'!E$211","v":"Active adjustment for business rates uncertainty mechanism - WWN - Real"},{"$f":"'Abstraction & Rates'!F$211","v":-0.69310108026158868},{"$f":"'Abstraction & Rates'!G$211","v":"£m"}]
[null,null,null,null,{"$f":"'Abstraction & Rates'!E$215","v":"Revenue adjustment business rates - WWN - Real"},{"$f":"'Abstraction & Rates'!F$215","v":-0.27931973534542026},{"$f":"'Abstraction & Rates'!G$215","v":"£m"}]
[null,null,null,null,{"$f":"'Abstraction & Rates'!E$219","v":"RCV adjustment business rates - WWN - Real"},{"$f":"'Abstraction & Rates'!F$219","v":-0.41378134491616841},{"$f":"'Abstraction & Rates'!G$219","v":"£m"}]
[]
[null,"Revenue adjustment"]
[null,null,null,null,{"$f":"'Cost sharing calculations'!E$548","v":"Cost sharing revenue adjustment - WWN - Real"},{"$f":"'Cost sharing calculations'!F$548","v":-1.4472198805610974},{"$f":"'Cost sharing calculations'!G$548","v":"£m"}]
[null,null,null,null,{"$f":"'Abstraction & Rates'!E215","v":"Revenue adjustment business rates - WWN - Real"},{"$f":"'Abstraction & Rates'!F215","v":-0.27931973534542026},{"$f":"'Abstraction & Rates'!G215","v":"£m"}]
[null,null,null,null,"Total Revenue adjustment for cost sharing - WWN - Real",{"$f":" SUM(F75:F76)","v":-1.7265396159065176},"£m"]
[]
[null,"RCV adjustment"]
[null,null,null,null,{"$f":"'Cost sharing calculations'!E$552","v":"Cost sharing RCV adjustment - WWN - Real"},{"$f":"'Cost sharing calculations'!F$552","v":-2.1438964483746279},{"$f":"'Cost sharing calculations'!G$552","v":"£m"}]
[null,null,null,null,{"$f":"'Abstraction & Rates'!E219","v":"RCV adjustment business rates - WWN - Real"},{"$f":"'Abstraction & Rates'!F219","v":-0.41378134491616841},{"$f":"'Abstraction & Rates'!G219","v":"£m"}]
[null,null,null,null,{"$f":"'Green Recovery'!E$129","v":"Active RCV adjustment for cost sharing - Green Recovery Expenditure - WWN - Real"},{"$f":"'Green Recovery'!F$129","v":0},{"$f":"'Green Recovery'!G$129","v":"£m"}]
[null,null,null,null,"Total RCV adjustment for cost sharing - WWN - Real",{"$f":" SUM(F80:F82)","v":-2.5576777932907961},"£m"]
[]
["BIORESOURCES"]
[]
[null,"Wage growth adjustment"]
[null,null,null,null,{"$f":"Bioresources!E$55","v":"Total adjustment for wage related totex - BIO - Real"},{"$f":"Bioresources!F$55","v":-0.70388782609740219},{"$f":"Bioresources!G$55","v":"£m"}]
[]
[null,"Abstraction & Business Rates uncertainty mechanism"]
[null,null,null,null,{"$f":"'Abstraction & Rates'!E$256","v":"Active adjustment for business rates uncertainty mechanism - BIO - Real"},{"$f":"'Abstraction & Rates'!F$256","v":-0.455069682508072},{"$f":"'Abstraction & Rates'!G$256","v":"£m"}]
[null,null,null,null,{"$f":"'Abstraction & Rates'!E$260","v":"Revenue adjustment business rates  - BIO - Real"},{"$f":"'Abstraction & Rates'!F$260","v":-0.33220086823089257},{"$f":"'Abstraction & Rates'!G$260","v":"£m"}]
[null,null,null,null,{"$f":"'Abstraction & Rates'!E$264","v":"RCV adjustment business rates - BIO - Real"},{"$f":"'Abstraction & Rates'!F$264","v":-0.12286881427717945},{"$f":"'Abstraction & Rates'!G$264","v":"£m"}]
[]
[null,"Revenue adjustment"]
[null,null,null,null,{"$f":"Bioresources!E91","v":"Cost sharing Revenue adjustment - BIO - Real"},{"$f":"Bioresources!F91","v":-0.51383811305110361},{"$f":"Bioresources!G91","v":"£m"}]
[null,null,null,null,{"$f":"'Abstraction & Rates'!E260","v":"Revenue adjustment business rates  - BIO - Real"},{"$f":"'Abstraction & Rates'!F260","v":-0.33220086823089257},{"$f":"'Abstraction & Rates'!G260","v":"£m"}]
[null,null,null,null,"Total Revenue adjustment for cost sharing - BIO - Real",{"$f":" SUM(F96:F97)","v":-0.84603898128199617},"£m"]
[]
[null,"RCV adjustment"]
[null,null,null,null,{"$f":"Bioresources!E95","v":"Cost sharing RCV adjustment - BIO - Real"},{"$f":"Bioresources!F95","v":-0.19004971304629861},{"$f":"Bioresources!G95","v":"£m"}]
[null,null,null,null,{"$f":"'Abstraction & Rates'!E264","v":"RCV adjustment business rates - BIO - Real"},{"$f":"'Abstraction & Rates'!F264","v":-0.12286881427717945},{"$f":"'Abstraction & Rates'!G264","v":"£m"}]
[null,null,null,null,"Total RCV adjustment for cost sharing - BIO - Real",{"$f":" SUM(F101:F102)","v":-0.31291852732347808},"£m"]
[]
[]
["TIDEWAY"]
[]
[null,"Revenue adjustment"]
[null,null,null,null,{"$f":"'Thames Tideway Tunnel'!E120","v":"Cost sharing revenue adjustment - TTT - Real"},{"$f":"'Thames Tideway Tunnel'!F120","v":0},{"$f":"'Thames Tideway Tunnel'!G120","v":"£m"}]
[]
[null,"RCV adjustment"]
[null,null,null,null,{"$f":"'Thames Tideway Tunnel'!E124","v":"Cost sharing RCV adjustment - TTT - Real"},{"$f":"'Thames Tideway Tunnel'!F124","v":0},{"$f":"'Thames Tideway Tunnel'!G124","v":"£m"}]
[]
[]
["END OF SHEET"]

{"sheet":"F_Outputs","index":20,"n_rows":19,"n_cols":6,"rows_kept":19,"cut":false,"hidden":false,"merged":[]}
[null,null,"PR24PD14_OUT"]
["Acronym","Reference","Item description","Unit","Model","2024-25"]
[]
[null,"C_PR24PD14_PD11_13WR_PR24","PR19 Costs reconciliation RCV adjustment in 2017-18 FYA (CPIH deflated) prices (WR) ","£m","Price Review 2024",{"$f":" Outputs!F31","v":-1.7115323985301016}]
[null,"C_PR24PD14_PD11_13WN_PR24","PR19 Costs reconciliation RCV adjustment in 2017-18 FYA (CPIH deflated) prices (WN) ","£m","Price Review 2024",{"$f":" Outputs!F57","v":11.075328740061112}]
[null,"C_PR24PD14_PD11_13WWN_PR24","PR19 Costs reconciliation RCV adjustment in 2017-18 FYA (CPIH deflated) prices (WWN) ","£m","Price Review 2024",{"$f":" Outputs!F83","v":-2.5576777932907961}]
[null,"C_PR24PD14_PD11_13BIO_PR24","PR19 Costs reconciliation RCV adjustment in 2017-18 FYA (CPIH deflated) prices (BR) ","£m","Price Review 2024",{"$f":" Outputs!F103","v":-0.31291852732347808}]
[null,"C_PR24PD14_PD11_13ADDN1_PR24","PR19 Costs reconciliation RCV adjustment in 2017-18 FYA (CPIH deflated) prices (ADDN1) ","£m","Price Review 2024",{"$f":" Outputs!F112","v":0}]
[null,"C_PR24PD14_PD11_13ADDN2_PR24","PR19 Costs reconciliation RCV adjustment in 2017-18 FYA (CPIH deflated) prices (ADDN2) ","£m","Price Review 2024"]
[null,"C_PR24PD14_PD12_28WR_PR24","PR19 Totex costs revenue adjustment in 2017-18 FYA (CPIH deflated) prices (WR) ","£m","Price Review 2024",{"$f":" Outputs!F25","v":-3.0559673188239422}]
[null,"C_PR24PD14_PD12_28WN_PR24","PR19 Totex costs revenue adjustment in 2017-18 FYA (CPIH deflated) prices (WN) ","£m","Price Review 2024",{"$f":" Outputs!F51","v":28.763983274547201}]
[null,"C_PR24PD14_PD12_28WWN_PR24","PR19 Totex costs revenue adjustment in 2017-18 FYA (CPIH deflated) prices (WWN) ","£m","Price Review 2024",{"$f":" Outputs!F77","v":-1.7265396159065176}]
[null,"C_PR24PD14_PD12_28BIO_PR24","PR19 Totex costs revenue adjustment in 2017-18 FYA (CPIH deflated) prices (BR) ","£m","Price Review 2024",{"$f":" Outputs!F98","v":-0.84603898128199617}]
[null,"C_PR24PD14_PD12_28ADDN1_PR24","PR19 Totex costs revenue adjustment in 2017-18 FYA (CPIH deflated) prices (ADDN1) ","£m","Price Review 2024",{"$f":" Outputs!F109","v":0}]
[null,"C_PR24PD14_PD12_28ADDN2_PR24","PR19 Totex costs revenue adjustment in 2017-18 FYA (CPIH deflated) prices (ADDN2) ","£m","Price Review 2024"]
[null,"PR24QA_PR24PD14_OUT1","Date & Time for Model - PR24PD14","Text","Price Review 2024",{"$f":"CONCATENATE(\"[…]\", TEXT(NOW(),\"dd/mm/yyy hh:mm:ss\"))","v":"[…]27/08/2024 15:26:48"}]
[null,"PR24QA_PR24PD14_OUT2","Name of Model - PR24PD14","Text","Price Review 2024",{"$f":"MID(CELL(\"filename\"),SEARCH(\"[\",CELL(\"filename\"))+1,SEARCH(\"]\",CELL(\"filename\"))-SEARCH(\"[\",CELL(\"filename\"))-1)","v":{"$error":"#VALUE!"}}]
[null,"PR24QA_PR24PD14_OUT3","F_Inputs time stamp - PR24PD14","Text","Price Review 2024",{"$f":"'F_Inputs-APR & PR19'!$E$1","v":"Run on 19 Feb 2024 12:17"}]
[null,"PR24QA_PR24PD14_OUT4","Model override switch for - PR24PD14","nr","Price Review 2024"]

{"sheet":"Integrity checks-->","index":21,"n_rows":0,"n_cols":0,"rows_kept":0,"cut":false,"hidden":false,"merged":[]}

{"sheet":"Check","index":22,"n_rows":25,"n_cols":16,"rows_kept":25,"cut":false,"hidden":false,"merged":[]}
[{"$f":" RIGHT(CELL(\"filename\", $A$1), LEN(CELL(\"filename\", $A$1)) - SEARCH(\"]\", CELL(\"filename\", $A$1)))","v":{"$error":"#VALUE!"}}]
[null,null,null,null,{"$f":"Time!E$22","v":"Model Period BEG"},null,null,null,null,{"$f":"Time!J$22","v":"2019-04-01"},{"$f":"Time!K$22","v":"2020-04-01"},{"$f":"Time!L$22","v":"2021-04-01"},{"$f":"Time!M$22","v":"2022-04-01"},{"$f":"Time!N$22","v":"2023-04-01"},{"$f":"Time!O$22","v":"2024-04-01"},{"$f":"Time!P$22","v":"2025-04-01"}]
[null,null,null,null,{"$f":"Time!E$23","v":"Model Period END"},{"$f":"Check!F$8","v":0},"Error chks",null,null,{"$f":"Time!J$23","v":"2020-03-31"},{"$f":"Time!K$23","v":"2021-03-31"},{"$f":"Time!L$23","v":"2022-03-31"},{"$f":"Time!M$23","v":"2023-03-31"},{"$f":"Time!N$23","v":"2024-03-31"},{"$f":"Time!O$23","v":"2025-03-31"},{"$f":"Time!P$23","v":"2026-03-31"}]
[null,null,null,null,{"$f":"Time!E$59","v":"Pre Forecast vs Forecast"},null,null,null,null,{"$f":"Time!J$59","v":"Pre Fcst"},{"$f":"Time!K$59","v":"Forecast"},{"$f":"Time!L$59","v":"Forecast"},{"$f":"Time!M$59","v":"Forecast"},{"$f":"Time!N$59","v":"Forecast"},{"$f":"Time!O$59","v":"Forecast"},{"$f":"Time!P$59","v":"Post-Fcst"}]
[null,null,null,null,{"$f":"Time!E$101","v":"Financial Year Ending"},null,null,null,null,{"$f":"Time!J$101","v":2020},{"$f":"Time!K$101","v":2021},{"$f":"Time!L$101","v":2022},{"$f":"Time!M$101","v":2023},{"$f":"Time!N$101","v":2024},{"$f":"Time!O$101","v":2025},{"$f":"Time!P$101","v":2026}]
[null,null,null,null,{"$f":"Time!E$11","v":"Model column counter"},"Constant","Unit","Total",null,{"$f":"Time!J$11","v":1},{"$f":"Time!K$11","v":2},{"$f":"Time!L$11","v":3},{"$f":"Time!M$11","v":4},{"$f":"Time!N$11","v":5},{"$f":"Time!O$11","v":6},{"$f":"Time!P$11","v":7}]
[]
[null,null,null,null,"Total error checks",{"$f":" SUM(F10:F23)","v":0},"check"]
[]
["[Do not delete]"]
[]
[null,null,null,null,{"$f":"'Cost sharing calculations'!E63","v":"WR Totex profile 100% check"},{"$f":"'Cost sharing calculations'!F63","v":0},{"$f":"'Cost sharing calculations'!G63","v":"Check"}]
[null,null,null,null,{"$f":"'Cost sharing calculations'!E116","v":"WR Totex profile - Cost sharing 100% check"},{"$f":"'Cost sharing calculations'!F116","v":0},{"$f":"'Cost sharing calculations'!G116","v":"Check"}]
[null,null,null,null,{"$f":"'Cost sharing calculations'!E230","v":"WN Totex profile - Base costs 100% check"},{"$f":"'Cost sharing calculations'!F230","v":0},{"$f":"'Cost sharing calculations'!G230","v":"Check"}]
[null,null,null,null,{"$f":"'Cost sharing calculations'!E283","v":"WN Totex profile - Cost Sharing 100% check"},{"$f":"'Cost sharing calculations'!F283","v":0},{"$f":"'Cost sharing calculations'!G283","v":"Check"}]
[null,null,null,null,{"$f":"'Cost sharing calculations'!E398","v":"WWN Totex profile 100% check"},{"$f":"'Cost sharing calculations'!F398","v":0},{"$f":"'Cost sharing calculations'!G398","v":"Check"}]
[null,null,null,null,{"$f":"'Cost sharing calculations'!E451","v":"WWN Totex profile - Cost Sharing 100% check"},{"$f":"'Cost sharing calculations'!F451","v":0},{"$f":"'Cost sharing calculations'!G451","v":"Check"}]
[null,null,null,null,{"$f":"Bioresources!E24","v":"WWN Totex profile 100% check"},{"$f":"Bioresources!F24","v":0},{"$f":"Bioresources!G24","v":"Check"}]
[null,null,null,null,{"$f":"Outputs!E15","v":"Water Resources cost sharing 100% check"},{"$f":"Outputs!F15","v":0},{"$f":"Outputs!G15","v":"Check"}]
[null,null,null,null,{"$f":"Outputs!E41","v":"Water Network cost sharing 100% check"},{"$f":"Outputs!F41","v":0},{"$f":"Outputs!G41","v":"Check"}]
[null,null,null,null,{"$f":"Outputs!E67","v":"Wastewater Network cost sharing 100% check"},{"$f":"Outputs!F67","v":0},{"$f":"Outputs!G67","v":"Check"}]
[]
["[Do not delete]"]
[]
["END OF SHEET"]